program: Gaussian 09
title: 000184161
version: EM64L-G09RevD.01
frameworkgroup: C1[X(C8H10BrCl3N2O)]
method: RPBEPBE
basis: SDD
operation: Freq
keyword: #p
keyword: freq=noraman
keyword: PBEPBE/SDD
title: #p freq=noraman PBEPBE/SDD
converged: YES YES NO NO
title: Mulliken charges:
elementType: Br Cl Cl Cl O N N C C C C C C C C H H H H H H H H H H
charge: -0.033272 0.033212 0.054495 0.024024 -0.221415 -0.061970 0.075042 -0.387956 -0.266873 -0.309020 -0.294938 -0.685842 -0.003753 -0.092368 -0.187104 0.217932 0.222174 0.219360 0.203367 0.228209 0.225164 0.253826 0.226447 0.281659 0.279601
chargesum: 0.00000
title: Mulliken charges with hydrogens summed into heavy atoms:
elementType: Br Cl Cl Cl O N N C C C C C C C C
charge: -0.033272 0.033212 0.054495 0.024024 -0.221415 -0.061970 0.075042 0.052150 0.155853 0.144353 0.185335 -0.124581 -0.003753 -0.092368 -0.187104
polarizability: 1.55111455e+02 -7.78759017e+00 1.63574112e+02 1.54666104e+01 -2.25669530e+00 1.10382747e+02
1716.lowfreq: -7.9214 -3.9487 -0.0016 -0.0013 0.0023 2.1591 15.3452 21.2972 37.8739
frequency: 15.1504 21.2530 37.6538 52.7843 60.5829 90.7895 112.5183 122.9301 144.0243 156.3952 167.4776 178.5999 198.3794 219.4096 286.5707 298.3525 350.6438 362.2342 396.0620 421.2963 507.9968 530.7770 586.9205 623.6270 633.0421 655.1054 731.9194 751.7205 788.3907 867.9344 899.4902 930.4186 1010.4389 1033.7748 1038.3795 1051.7046 1053.3371 1099.8408 1105.5765 1151.6725 1193.4553 1219.5623 1231.7758 1240.3825 1283.9763 1286.8661 1289.9941 1291.5449 1344.4140 1352.8896 1382.5881 1399.3599 1406.0718 1450.2724 1450.5156 1472.1299 1476.6071 1489.5272 1504.5630 2948.5868 2993.5560 3001.1377 3002.1239 3008.4464 3045.0889 3049.9248 3071.1668 3112.2086 3134.8364
redmass: 15.2264 24.5464 2.4620 4.1530 7.7751 6.0589 1.8975 4.1614 5.6923 28.8743 6.3849 6.7773 13.1332 10.1482 10.6981 2.8100 7.3186 32.3152 3.2289 8.1111 4.5498 10.7134 8.6094 5.6340 9.0332 11.2980 7.1110 1.0732 1.1485 5.4017 1.2403 9.8240 3.8843 3.2021 1.2879 4.2112 2.7399 2.8686 10.7920 1.3044 6.1358 1.2475 1.4141 1.6234 1.1379 1.3538 1.0918 5.0413 1.4577 1.8927 1.4753 2.2867 2.0259 1.1242 1.1023 1.0732 1.0871 1.0962 11.4576 1.0561 1.0599 1.0649 1.0595 1.1040 1.1032 1.0564 1.1053 1.1003 1.1113
irintensity: 0.7383 0.1857 1.0966 0.1884 0.7981 2.4836 0.9966 1.0520 1.8537 0.0624 2.2830 1.3921 0.9198 2.3725 0.9297 6.8321 5.6352 0.3125 6.7303 8.0351 3.1167 5.4875 23.3934 21.7813 8.4123 8.7478 41.1322 10.5145 0.9307 19.1814 0.7255 26.7492 94.3016 47.1684 6.4510 116.9086 70.2501 7.4846 78.8179 3.2657 109.1111 13.8928 4.0649 24.4914 0.5331 33.3774 1.4260 133.6913 6.0963 23.0801 17.4498 111.1095 66.7774 27.9746 4.4893 1.1704 3.9445 12.2097 39.6313 25.6720 1.3774 43.3388 30.5080 19.9678 0.7601 21.9903 50.9254 3.7253 16.1183
temp: 298.150 k
press: 1.00000 atm
elementType: 35 17 17 17 8 7 7 6 6 6 6 6 6 6 6 1 1 1 1 1 1 1 1 1 1
symmnumber: 1
zpe: 459837.0 jmol-1
zpe.correction: 0.175143 hartree
zpe.thermalcorrener: 0.192060 hartree
zpe.thermalcorrenthalpy: 0.193004 hartree
zpe.thermalcorrgfe: 0.124816 hartree
zpe.sumelectzpe: -1888.015226 hartree
zpe.sumelectthermal: -1887.998309 hartree
zpe.sumelectthermalent: -1887.997365 hartree
zpe.sumelectthermalfe: -1888.065552 hartree
dipole: 0.7508 1.7792 3.7041
dipole: 4.1772
quadrupole: -146.8951 -120.3069 -117.9125
quadrupole: 2.5889 -8.3136 1.0540
quadrupole: -18.5236 8.0646 10.4590 2.5889 -8.3136 1.0540
hfenergy: -1888.1903688 hartree
pointgroup: C01 [X(C8H10Br1Cl3N2O1)]
dipole: 0.5238976 0.838033 1.3130761 debye
dipolederiv: -0.4762564 0.1542697 0.0883755 0.2909181 -0.3204519 -0.074848 0.0796598 -0.0301294 -0.1687766 -0.1270764 0.1185629 -0.2140541 0.0681473 -0.2240737 0.217102 -0.2136361 0.2708263 -0.3446866 -0.0367143 -0.044974 -0.0189291 -0.010346 -0.622499 0.2120043 -0.0422947 0.173204 -0.1026366 -0.1719751 -0.2348713 -0.0638646 -0.310502 -0.512228 -0.082123 -0.0763709 -0.0691231 -0.0486836 -1.2956968 0.0863554 0.0567944 0.253049 -0.4301193 -0.1622501 0.2952436 -0.1202569 -0.4660295 -0.8065195 -0.2260015 -0.3001956 -0.5682798 -0.5703555 -0.1558701 -0.5199231 -0.1224469 -0.475819 -0.4270415 -0.2315383 -0.1554583 -0.3211412 -0.9197203 0.0736808 -0.213653 0.0384519 -0.3459702 -0.1764191 0.1021454 0.1116617 -0.0763413 0.1492198 0.0502422 0.1430913 -0.0334393 0.1011403 0.6926906 -0.161879 -0.026811 -0.3091924 0.3224558 0.0650766 -0.0439394 0.0858329 0.3865004 -0.1135744 0.0266153 0.0828791 0.1483558 -0.0649422 -0.0380587 0.0734595 0.0213596 0.1119683 1.4837555 0.1891576 0.0385881 0.4559187 0.3721807 0.1284066 0.0236461 0.2033595 0.5853599 0.5883981 -0.337141 -0.1053119 -0.3767625 0.4544037 0.0906395 -0.1186017 0.0802076 0.153242 0.2136534 -0.1259842 0.3393803 0.1625975 0.3371223 -0.2007912 0.3036766 -0.3627108 0.4852369 0.4091033 0.2638324 0.2194014 0.0226774 1.1642458 -0.3512824 0.4622476 -0.1382177 0.3753992 0.2052229 0.3718233 0.1472826 0.6176886 1.018532 0.1723485 0.0372395 0.0124996 0.053807 0.0220698 -0.0736281 -0.0561037 -0.0735868 -0.0324776 -0.076298 -0.052451 -0.0943906 0.0085044 0.0793725 0.0187475 -0.0230336 0.0001467 0.0319702 0.0735982 -0.0248558 0.0906538 -0.0841598 -0.0334921 -0.0546329 -0.0448715 0.0046369 -0.0805004 -0.0744668 -0.0720329 -0.0922013 -0.0251783 0.003758 0.0280388 0.0191794 0.0833363 -0.0168622 0.053844 -0.0019488 0.0900262 -0.1359521 0.0218136 -0.0659079 -0.053706 -0.0772084 -0.0267192 -0.0661014 -0.0505158 -0.0823084 0.0134724 0.0688287 0.0185728 -0.0086945 -0.0009556 0.0315052 0.0802672 -0.0153242 0.084795 -0.0944078 -0.0685598 0.0492263 0.0249232 0.0254324 -0.0196393 -0.0683639 0.0144155 0.0161592 0.1084642 -0.0406271 -0.0076747 -0.0231121 -0.0575918 0.0757088 0.1393545 0.0286078 0.0205591 -0.0746895 0.0065453 0.0992315 -0.033407 0.0648934 -0.0281965 0.0746404 0.0242524 0.05348 -0.0487083 -0.0212592 0.0376542 -0.0009128 -0.0158904 -0.0885591 -0.080751 -0.0399925 -0.0961904 0.0326029 unknown
polarizability: 156.5306915|-5.9053699|163.3789935|10.7621345|-9.9690012|109.1586292 unknown
InChI: InChI=1S/C8H10BrCl3N2O/c9-3-1-2-4-15-5-14-7(11)6(10)13-8(14)12/h1-5H2
charge 0 multiplicity 1
25 atoms
Br 6.482107 -1.796511 -1.093414
Cl -1.116671 -1.938999 2.033186
Cl -2.143349 2.538551 -1.1046
Cl -3.51974 -2.783393 -0.555436
O  0.795424 1.383483 0.655338
N  -1.459321 0.436604 0.575921
N  -2.978418 -0.099416 -1.037237
C  2.949536 0.565137 -0.067779
C  1.607476 0.149699 0.540619
C  3.894963 -0.651919 -0.245613
C  -0.461993 1.217126 1.34209
C  5.222782 -0.21474 -0.868364
C  -1.793296 -0.931342 0.733486
C  -2.216018 0.862764 -0.516763
C  -2.722045 -1.223612 -0.257321
H  3.417083 1.324131 0.587941
H  2.759177 1.050989 -1.043674
H  1.0882 -0.583489 -0.110035
H  1.741904 -0.302098 1.546778
H  3.417833 -1.413404 -0.891106
H  4.086626 -1.130946 0.733232
H  -0.854539 2.23623 1.477824
H  -0.338712 0.709013 2.318558
H  5.103027 0.192509 -1.884283
H  5.778063 0.494434 -0.234848
