program: Gaussian 09
title: 000184303
version: EM64L-G09RevD.01
frameworkgroup: C1[X(C19H16ClF3N2O7)]
method: RPBEPBE
basis: SDD
operation: Freq
keyword: #p
keyword: freq=noraman
keyword: PBEPBE/SDD
title: #p freq=noraman PBEPBE/SDD
converged: YES YES NO NO
title: Mulliken charges:
elementType: Cl F F F O O O O O O O N N C C C C C C C C C C C C C C C C C C C H H H H H H H H H H H H H H H H
charge: 0.005794 -0.163157 -0.163713 -0.162171 -0.267669 -0.278265 -0.246029 -0.202162 -0.196685 -0.264203 -0.241887 0.024726 0.024058 0.350816 0.181096 0.361004 -0.469304 0.003758 -0.344075 -0.370801 0.487489 -0.377516 0.305212 -0.325286 -0.312915 -0.324868 -0.348909 0.265137 -0.529094 -0.370458 0.275438 -0.501056 0.304905 0.291950 0.276299 0.242731 0.249332 0.297584 0.289207 0.272410 0.220624 0.212090 0.269536 0.258858 0.259034 0.246730 0.244842 0.239561
chargesum: 0.00000
title: Mulliken charges with hydrogens summed into heavy atoms:
elementType: Cl F F F O O O O O O O N N C C C C C C C C C C C C C C C C C C C
charge: 0.005794 -0.163157 -0.163713 -0.162171 -0.267669 -0.278265 -0.246029 -0.202162 -0.196685 -0.264203 -0.241887 0.024726 0.024058 0.350816 0.181096 0.361004 -0.164399 0.003758 -0.052125 -0.094502 0.487489 0.114547 0.305212 -0.325286 -0.015330 -0.035661 -0.076499 0.265137 0.173156 0.147434 0.275438 0.230076
polarizability: 3.45760860e+02 3.82436573e+01 2.72449859e+02 1.47534802e+01 -1.84456892e+01 2.24599191e+02
1716.lowfreq: -4.7788 -3.0424 -0.0018 -0.0017 -0.0010 3.6952 4.3830 6.2476 15.8123
frequency: -1.0257 5.1714 15.8052 19.3453 24.3506 26.6433 41.5841 49.5833 50.4228 70.2900 75.1901 87.2442 89.1550 95.1424 103.3913 121.2694 134.6692 142.9226 156.0860 160.3318 177.3438 189.9900 195.7424 210.6125 228.6155 245.7775 253.2864 266.3925 283.2904 297.8309 305.0294 323.7113 338.0501 353.2573 361.8726 379.7998 392.4613 395.8047 423.9264 441.1366 455.1804 467.4967 478.4279 491.6041 527.4634 533.2178 542.2459 589.3509 603.7284 610.4811 630.2272 636.1933 656.1972 661.7143 666.8027 679.7863 703.3669 730.0608 737.7029 750.1210 772.1618 802.4629 828.9169 832.0134 833.9915 838.3505 848.4239 894.0189 901.1345 917.4560 933.9644 966.5315 977.7275 983.3031 985.6802 998.6190 1011.7023 1018.7475 1030.3922 1038.0457 1044.0797 1047.6690 1102.3257 1113.3321 1115.4020 1136.5376 1146.4793 1149.0580 1149.7183 1163.2728 1177.7389 1210.3981 1226.5488 1229.2351 1240.0070 1250.7583 1262.6082 1291.3714 1304.2289 1328.1761 1336.7873 1357.4652 1372.8506 1397.1406 1402.4705 1412.1091 1416.7555 1423.7781 1435.4093 1449.6309 1454.2953 1462.6732 1463.8824 1471.0001 1483.6425 1484.9139 1572.1256 1576.7235 1587.6261 1603.2761 1615.7022 1659.5454 2956.5010 3009.0870 3021.7440 3023.1488 3050.3679 3095.1080 3105.0360 3113.0288 3113.6097 3156.1859 3160.9605 3174.1433 3176.3204 3178.5067 3181.4044 3191.6484
redmass: 11.0700 9.2582 8.6278 7.4750 6.9490 6.5237 6.4903 4.6372 5.8801 6.7087 5.5707 2.1261 1.8778 5.4900 3.9096 5.6819 12.0201 5.9611 5.0310 5.7189 4.6159 2.3617 2.1378 4.8067 3.3564 9.5264 7.8902 6.9845 7.8198 5.8536 6.7084 7.7328 8.9762 8.3217 6.3379 3.6529 9.3120 2.9791 7.3966 3.5897 4.1719 5.5765 7.6416 6.0391 6.6699 7.9835 3.6044 7.8515 6.2753 6.7847 5.2005 6.2242 6.8209 6.6725 6.4559 7.7286 5.2396 5.2195 4.9368 6.4217 9.8334 6.4588 5.1005 3.0068 1.8416 6.0283 1.5922 1.4380 1.6675 3.7524 7.4493 1.4027 1.8712 1.5514 8.0671 2.7095 4.7525 8.6399 6.9687 5.5751 4.0535 3.3290 2.0045 1.2628 1.3659 1.6935 1.4158 3.2799 1.5302 1.4512 2.2376 6.9728 1.3911 1.3575 1.9085 2.0227 1.5323 2.6623 2.4734 1.2930 1.4195 7.0450 6.0034 7.4605 5.3747 4.2285 1.0996 1.1613 1.1169 1.0974 1.0499 1.0702 1.0508 2.9386 1.1584 2.3919 8.7404 8.4684 7.4159 7.7424 6.8498 9.5739 1.0321 1.0295 1.0612 1.0579 1.1027 1.1037 1.1017 1.1049 1.1038 1.1051 1.0895 1.0892 1.0932 1.0933 1.0967 1.0974
irintensity: 0.1988 0.2226 0.3760 0.3857 0.5540 0.8022 2.0035 0.4639 0.4096 0.9096 0.9820 1.0950 1.3378 0.5983 3.4813 5.5373 3.7599 0.7858 2.0646 5.6504 7.5414 0.8216 0.2538 2.5423 10.0360 4.4661 8.2143 2.1151 4.0321 7.8660 1.9081 20.5164 8.5371 2.1784 13.1022 5.2355 2.1241 4.0287 2.3929 12.8549 4.7919 13.2907 3.0448 2.7938 4.6006 0.9139 8.2439 17.9601 19.4452 5.7286 2.2867 6.8315 10.2293 6.3223 19.7449 6.1895 15.4522 29.8723 12.5637 15.8748 23.0910 139.1093 35.0992 17.2190 53.0075 1.0932 34.5869 40.8942 11.0781 25.4563 17.5373 12.2390 26.0365 8.7181 257.7207 40.0102 22.6799 316.5607 47.5878 174.7596 59.3722 63.2507 16.0051 0.0360 6.9348 36.8754 25.7809 269.6420 14.6031 9.9103 89.8480 688.6197 6.6515 5.7466 50.8406 304.0791 56.8284 371.1074 45.3038 6.8821 14.3374 158.3087 15.0690 6.0430 20.8458 64.5918 34.4513 9.2860 3.3415 9.1182 15.4327 15.2488 11.7166 67.7971 3.4287 77.4150 22.4820 7.7275 234.5417 101.4858 9.7649 187.5744 43.6294 28.9025 23.0090 27.6307 33.9844 2.1045 20.4862 22.5563 13.2138 15.0547 1.3343 0.5016 1.0876 1.5042 0.3465 3.0807
temp: 298.150 k
press: 1.00000 atm
elementType: 17 9 9 9 8 8 8 8 8 8 8 7 7 6 6 6 6 6 6 6 6 6 6 6 6 6 6 6 6 6 6 6 1 1 1 1 1 1 1 1 1 1 1 1 1 1 1 1
symmnumber: 1
zpe: 860911.1 jmol-1
zpe.correction: 0.327904 hartree
zpe.thermalcorrener: 0.358931 hartree
zpe.thermalcorrenthalpy: 0.359875 hartree
zpe.thermalcorrgfe: 0.259456 hartree
zpe.sumelectzpe: -2126.760518 hartree
zpe.sumelectthermal: -2126.729492 hartree
zpe.sumelectthermalent: -2126.728547 hartree
zpe.sumelectthermalfe: -2126.828966 hartree
dipole: 0.2302 2.2475 1.7452
dipole: 2.8548
quadrupole: -230.1696 -168.4964 -187.8882
quadrupole: -21.8756 1.9727 7.1670
quadrupole: -34.6515 27.0217 7.6299 -21.8756 1.9727 7.1670
hfenergy: -2127.088422 hartree
pointgroup: C01 [X(C19H16Cl1F3N2O7)]
dipole: -0.4549839 -0.7145194 -0.7375495 debye
polarizability: 287.7677515|-46.5089029|317.0501995|-42.2131879|14.2113265|237.9919596 unknown
InChI: InChI=1S/C19H16ClF3N2O7/c1-29-9-15(24-31-10-18(26)30-2)13-8-12(4-5-16(13)25(27)28)32-17-6-3-11(7-14(17)20)19(21,22)23/h3-8H,9-10H2,1-2H3
charge 0 multiplicity 1
48 atoms
Cl 2.871868 0.319376 -3.851106
F  3.956732 -4.065574 0.735676
F  4.360363 -4.262167 -1.49385
F  5.832638 -3.172632 -0.164084
O  1.851222 1.632923 -1.390849
O  -0.838656 -0.209586 2.826308
O  -4.046406 -0.461428 1.197184
O  -2.59395 5.325263 1.219009
O  -3.219248 3.34869 2.166925
O  -4.940392 -2.715939 -1.560975
O  -2.906401 -2.506627 -0.4373
N  -2.45342 4.053703 1.395309
N  -3.164915 0.482343 0.477691
C  -1.3063 1.948617 0.620014
C  -1.356232 3.367924 0.685074
C  0.767585 2.162807 -0.66237
C  -0.237547 1.355497 -0.085075
C  -2.287967 1.029741 1.287766
C  -0.377036 4.175677 0.059348
C  0.699361 3.573811 -0.608929
C  2.400587 0.372628 -1.096295
C  -2.021479 0.666173 2.746662
C  3.704923 -2.084708 -0.641651
C  2.978703 -0.342701 -2.174227
C  2.488864 -0.148765 0.216781
C  3.631284 -1.566198 -1.954943
C  3.138175 -1.37603 0.442532
C  4.440086 -3.370336 -0.397438
C  -1.135562 -1.617252 2.496347
C  -4.875317 -1.115263 0.194957
C  -4.096195 -2.166352 -0.601237
C  -4.348708 -3.773305 -2.420977
H  -0.204434 0.266835 -0.170314
H  -0.475724 5.262386 0.117641
H  1.483097 4.167439 -1.086178
H  -2.910318 0.184796 3.193489
H  -1.758982 1.568573 3.318118
H  2.05574 0.401372 1.056898
H  4.061857 -2.113192 -2.798101
H  3.200113 -1.778801 1.457159
H  -0.183728 -2.156298 2.628627
H  -1.894919 -2.026918 3.192174
H  -1.500953 -1.739605 1.459292
H  -5.312844 -0.378996 -0.502129
H  -5.6877 -1.607698 0.756834
H  -3.499492 -3.36341 -2.992296
H  -4.000056 -4.616313 -1.801521
H  -5.165521 -4.080183 -3.08807
