program: Gaussian 09
title: 000184155
version: EM64L-G09RevD.01
frameworkgroup: C1[X(C16H25N)]
method: RPBEPBE
basis: SDD
operation: Freq
keyword: #pfreq=noraman
keyword: PBEPBE/SDD
title: #p freq=noraman PBEPBE/SDD
converged: NO YES NO NO
title: Mulliken charges:
elementType: N C C C C C C C C C C C C C C C C H H H H H H H H H H H H H H H H H H H H H H H H H
charge: -0.025826 0.404375 -0.379160 -0.205504 0.016773 -0.506681 -0.510100 -0.492881 0.634299 -0.432767 -0.776778 -0.059387 -0.592945 -0.747067 -0.735235 -0.806080 -0.267682 0.236571 0.269778 0.199982 0.204104 0.202090 0.217693 0.219105 0.206514 0.210817 0.209067 0.218998 0.210281 0.240582 0.211043 0.230782 0.212083 0.223099 0.214503 0.220204 0.227676 0.209030 0.218409 0.216183 0.229498 0.224552
chargesum: 0.00000
title: Mulliken charges with hydrogens summed into heavy atoms:
elementType: N C C C C C C C C C C C C C C C C
charge: -0.025826 0.404375 -0.142590 0.064274 0.216755 -0.100487 -0.073302 -0.075550 0.634299 -0.004702 -0.114872 0.171395 -0.157762 -0.084683 -0.091612 -0.352030 -0.267682
polarizability: 1.82034411e+02 -4.55529899e+00 1.78398479e+02 1.89471122e+00 -8.01786973e+00 1.47530486e+02
1716.lowfreq: -7.7376 -5.4143 -0.0007 -0.0001 0.0005 17.1488 37.5780 52.4262 69.7132
frequency: 36.9144 52.3159 69.6427 111.0645 127.5349 138.1778 182.1144 194.5063 204.6496 213.5536 231.9237 239.5183 242.7230 257.5111 284.7638 305.1597 317.0985 351.4782 369.1950 393.0998 412.8994 423.5769 445.0452 477.6098 483.8113 491.9219 541.5501 567.7784 592.5300 630.9157 697.2193 736.4011 784.3661 803.0509 842.0213 854.3955 870.0101 893.4495 900.4940 917.5024 933.0277 945.7285 955.4330 958.1112 966.5919 976.5434 992.7841 998.5502 1013.8495 1030.4182 1054.5251 1068.3854 1080.8239 1094.6124 1104.1686 1140.8616 1158.3248 1161.7781 1178.0720 1188.7766 1198.8054 1203.7521 1242.2087 1243.5805 1276.4479 1285.7600 1292.2033 1298.4287 1302.9788 1305.8938 1316.1165 1328.4637 1339.3583 1340.2697 1342.0074 1346.9726 1350.2299 1364.3641 1379.8126 1387.7734 1397.2686 1435.2244 1456.4123 1463.5141 1465.7092 1466.9137 1472.6056 1476.7247 1477.3770 1478.9098 1488.4776 1489.8668 1493.4258 1665.5613 2067.4587 2946.6893 2951.7924 2957.9884 2966.6850 2970.9718 2972.3297 2976.8443 2977.7565 2985.9867 2987.7476 2989.5299 3000.7590 3017.7070 3020.2712 3039.3124 3045.2242 3050.0655 3060.2462 3064.2717 3067.7977 3071.2624 3073.9871 3084.1515 3085.6169 3188.3896
redmass: 2.3688 4.4407 3.7275 3.5715 5.4910 2.8769 2.7188 2.0896 1.1732 1.5703 1.5815 1.5185 2.5116 3.3284 2.0938 2.4372 2.6570 2.5862 3.1841 2.7040 2.5576 3.0905 2.6367 2.4869 3.9023 3.4441 2.8273 2.4450 2.6290 3.5653 1.2823 1.8784 3.0502 2.2402 1.8607 2.0685 1.8383 2.1620 1.8945 1.2513 2.0934 1.4564 1.5899 1.8220 1.9079 2.0263 1.8255 1.9541 2.2829 2.2855 1.9525 1.7716 2.3047 1.6666 1.7148 1.9053 1.9516 1.9638 1.7547 1.7621 1.8336 1.7176 1.4989 1.3420 1.4782 1.7428 1.4191 1.3607 1.5014 1.2637 1.4851 1.2627 1.4446 1.3607 1.4838 1.4213 1.4326 1.4477 1.2070 1.1997 1.2124 1.1657 1.0784 1.0922 1.0457 1.0801 1.0644 1.0674 1.0698 1.0744 1.0574 1.0515 1.0647 5.5534 12.5972 1.0815 1.0668 1.0605 1.0595 1.0357 1.0417 1.0743 1.0396 1.0832 1.0643 1.0630 1.0840 1.0966 1.0990 1.0953 1.1009 1.1012 1.0987 1.0997 1.0992 1.0983 1.0984 1.0978 1.0626 1.1139
irintensity: 0.0993 1.5392 0.9036 1.3220 4.0688 0.7444 1.4861 0.0651 0.0794 0.2723 0.1315 0.0544 0.2803 0.0419 0.2283 0.1994 0.3042 0.0021 0.3591 0.0683 1.0623 0.0226 0.1413 0.8571 0.1003 0.7296 7.4386 2.7150 2.9773 12.2135 0.8435 1.6610 1.9469 2.1677 6.1234 0.9621 12.4419 2.6024 6.8878 1.4507 21.5511 44.2185 2.2672 1.4238 5.3490 7.3361 0.7873 2.2538 0.1002 0.7178 3.1209 8.4787 0.7536 0.0070 0.2158 3.0775 2.4206 1.9879 4.3169 13.5011 4.0891 0.7817 8.4921 1.6135 2.4262 2.8716 0.9086 1.1313 1.7240 2.3811 2.9316 3.8082 2.2403 0.1745 4.6930 0.5479 2.0102 1.5088 23.7784 16.1590 17.8413 6.6181 3.9074 4.4215 4.1804 13.7038 13.7247 7.2418 1.1594 16.8092 17.6083 8.3263 4.5658 20.9684 97.9931 12.5139 24.7092 30.8952 29.3883 34.4782 28.6232 25.0013 8.0922 7.9514 27.2721 28.2409 42.0317 20.3690 71.6756 38.9102 52.1000 61.5778 43.9235 16.6504 14.1749 63.1381 74.5337 29.6012 7.2289 19.9037
temp: 298.150 k
press: 1.00000 atm
elementType: 7 6 6 6 6 6 6 6 6 6 6 6 6 6 6 6 6 1 1 1 1 1 1 1 1 1 1 1 1 1 1 1 1 1 1 1 1 1 1 1 1 1
symmnumber: 1
zpe: 976063.8 jmol-1
zpe.correction: 0.371763 hartree
zpe.thermalcorrener: 0.389552 hartree
zpe.thermalcorrenthalpy: 0.390497 hartree
zpe.thermalcorrgfe: 0.327626 hartree
zpe.sumelectzpe: -678.072198 hartree
zpe.sumelectthermal: -678.054409 hartree
zpe.sumelectthermalent: -678.053465 hartree
zpe.sumelectthermalfe: -678.116335 hartree
dipole: -0.6416 -4.4635 1.0330
dipole: 4.6262
quadrupole: -103.1915 -122.7641 -103.4341
quadrupole: -4.8677 -0.7725 3.2993
quadrupole: 6.6051 -12.9675 6.3625 -4.8677 -0.7725 3.2993
hfenergy: -678.4439612 hartree
pointgroup: C01 [X(C16H25N1)]
dipole: 0.2730474 -1.7842618 -0.233639 debye
polarizability: 181.865538|4.6086249|179.7013077|2.2846308|5.1257359|146.3965306 unknown
InChI: InChI=1S/C16H25N/c1-11(2)13-8-10-16(4)9-6-7-12(3)14(16)15(13)17-5/h11,13-15H,3,6-10H2,1-2,4H3
charge 0 multiplicity 1
42 atoms
N  -0.776803 1.981554 0.011613
C  1.206804 -1.303938 0.474316
C  0.857048 0.228435 0.587555
C  -0.492687 0.573164 -0.147664
C  -1.687071 -0.29201 0.365028
C  -0.028547 -2.163601 0.871081
C  -1.334033 -1.781609 0.142263
C  1.663666 -1.643525 -0.979797
C  2.007961 1.087805 0.065397
C  2.823526 -0.753097 -1.485377
C  2.350202 -1.627585 1.47318
C  -3.060611 0.138729 -0.244379
C  2.484154 0.75579 -1.341994
C  -3.148721 -0.038464 -1.780379
C  -4.236268 -0.588173 0.453204
C  2.569676 2.070869 0.813644
C  -1.00461 3.152223 0.171334
H  0.691286 0.462955 1.659526
H  -0.370632 0.389615 -1.233221
H  -1.755154 -0.119413 1.462333
H  -0.193676 -2.056679 1.963652
H  0.208876 -3.231424 0.690612
H  -1.249951 -1.993595 -0.941489
H  -2.156737 -2.416021 0.520832
H  0.809158 -1.543442 -1.678557
H  1.967058 -2.70919 -1.012921
H  3.038994 -0.987777 -2.54574
H  3.74597 -0.975151 -0.916167
H  2.634642 -2.694731 1.402184
H  3.250747 -1.017007 1.29184
H  2.023935 -1.433083 2.512634
H  -3.173348 1.220684 -0.029111
H  1.688031 1.008569 -2.074655
H  3.360544 1.376174 -1.603905
H  -3.082604 -1.102595 -2.074804
H  -4.116939 0.345758 -2.150429
H  -2.354171 0.516826 -2.311766
H  -4.247933 -1.669213 0.219835
H  -5.202026 -0.168322 0.116699
H  -4.18485 -0.475841 1.552701
H  2.211099 2.30294 1.823411
H  3.392792 2.684998 0.429181
