program: Gaussian 09
title: 000184143
version: EM64L-G09RevD.01
frameworkgroup: C1[X(C13H17N3)]
method: RPBEPBE
basis: SDD
operation: Freq
keyword: #pfreq=noraman
keyword: PBEPBE/SDD
title: #p freq=noraman PBEPBE/SDD
converged: YES YES NO NO
title: Mulliken charges:
elementType: N N N C C C C C C C C C C C C C H H H H H H H H H H H H H H H H H
charge: -0.456980 -0.080536 -0.569121 -0.296745 0.122955 0.455275 0.423309 -0.701679 -0.538029 -0.509506 -0.375251 -0.447132 -0.381809 -0.224213 -0.235750 -0.246612 0.228235 0.318740 0.218495 0.212519 0.255575 0.232837 0.216403 0.258989 0.201624 0.204890 0.236558 0.249526 0.227522 0.226533 0.229795 0.278631 0.264953
chargesum: 0.00000
title: Mulliken charges with hydrogens summed into heavy atoms:
elementType: N N N C C C C C C C C C C C C C
charge: -0.138240 -0.080536 -0.025537 -0.068509 0.122955 0.455275 0.423309 -0.015089 -0.088789 -0.250516 0.031263 -0.210574 -0.132283 0.003309 -0.009217 -0.016818
polarizability: 1.74119554e+02 1.35493566e+01 1.68007900e+02 1.20865339e+01 -1.33499445e-01 1.19180752e+02
1716.lowfreq: -12.2942 0.0000 0.0006 0.0009 1.8231 7.2750 15.4633 28.2732 37.1703
frequency: 7.6811 28.1857 37.1339 58.5992 80.5068 95.2614 152.0986 172.1333 206.8572 214.6958 245.8102 264.6966 287.1882 336.3010 341.1840 388.3174 405.3258 447.3917 540.7034 587.7998 595.0600 612.4334 637.2436 659.4199 674.5879 707.8233 736.0298 748.1683 774.6237 783.2105 790.5935 829.1052 858.1806 922.8904 936.0039 943.4627 979.1331 988.7107 995.9174 999.2956 1012.3372 1024.0590 1027.2391 1062.1642 1063.5186 1089.9705 1093.6406 1113.1037 1144.1584 1172.2441 1188.5061 1199.0176 1211.8014 1230.9133 1242.5886 1275.7897 1280.4515 1293.9698 1310.0067 1338.2201 1362.4929 1371.4491 1377.7308 1382.1377 1387.3037 1442.0816 1462.6452 1463.5458 1470.6998 1481.9340 1490.3949 1494.6825 1568.5557 1592.0335 1611.7793 1641.8119 2895.1423 2952.2293 2987.7258 2994.2481 3011.3306 3050.3121 3092.4581 3108.8234 3116.1156 3119.6219 3133.7142 3144.4045 3162.7591 3221.6418 3460.1542 3572.7287 3586.9954
redmass: 2.8294 4.4799 3.5386 3.3255 2.6284 4.1903 3.3918 3.2911 1.2678 1.1604 2.4270 2.9147 3.9763 3.4278 3.7265 4.6171 2.8281 3.7735 3.0655 4.7183 1.3201 5.6623 4.3950 3.6728 1.1590 1.7904 3.4733 3.1705 2.2638 1.1968 2.9619 1.4232 1.2445 1.4338 1.9026 3.8129 1.3879 4.5896 1.3862 2.1813 3.4700 2.1241 2.1226 2.0789 1.7195 2.4210 1.8840 1.5145 2.7186 1.0550 1.1179 1.7060 1.7704 1.3869 1.8371 1.7360 1.2746 1.3297 1.4547 1.3337 3.9056 3.1656 1.4248 2.9883 1.5207 2.1441 1.1353 1.1191 1.2529 2.3153 1.0879 2.4479 4.7349 6.0149 6.0767 1.0942 1.0704 1.0824 1.0601 1.0347 1.0900 1.1021 1.1007 1.1005 1.0869 1.0866 1.0910 1.0959 1.1014 1.0985 1.0450 1.0811 1.0976
irintensity: 0.4542 2.5038 0.8340 3.4509 2.7536 0.1836 0.7582 3.6501 24.1359 18.8251 6.7175 1.6034 0.3923 10.7632 6.0552 4.8926 0.0425 3.0978 18.5605 5.4358 218.6656 4.9878 9.3638 19.5971 70.3386 51.5419 2.8471 10.6037 25.7332 3.3318 6.6918 37.0722 0.3447 3.8375 2.0343 5.6641 0.2281 1.5402 0.2266 12.9336 3.6277 8.4195 2.0512 6.8641 11.1829 19.1509 6.3576 17.6516 10.3831 0.1209 1.1120 15.3176 4.5012 7.6406 6.0094 7.0750 11.6923 16.2301 2.7612 2.1426 15.6497 9.5572 12.4433 4.6970 14.7097 12.1053 9.9176 12.5996 1.3232 10.3796 4.8413 40.5985 34.1262 0.9056 6.2905 38.9092 82.6126 20.3814 37.9758 28.0928 22.2540 39.9540 31.5728 18.8302 8.5688 2.8814 10.6282 39.3801 23.1456 9.6395 0.6776 27.5349 0.7658
temp: 298.150 k
press: 1.00000 atm
elementType: 7 7 7 6 6 6 6 6 6 6 6 6 6 6 6 6 1 1 1 1 1 1 1 1 1 1 1 1 1 1 1 1 1
symmnumber: 1
zpe: 727659.4 jmol-1
zpe.correction: 0.277151 hartree
zpe.thermalcorrener: 0.292912 hartree
zpe.thermalcorrenthalpy: 0.293856 hartree
zpe.thermalcorrgfe: 0.230698 hartree
zpe.sumelectzpe: -668.652387 hartree
zpe.sumelectthermal: -668.636626 hartree
zpe.sumelectthermalent: -668.635682 hartree
zpe.sumelectthermalfe: -668.698840 hartree
dipole: 0.3204 -3.5789 -0.0303
dipole: 3.5934
quadrupole: -83.3362 -100.5150 -94.2323
quadrupole: -1.5607 8.1277 -6.2116
quadrupole: 9.3583 -7.8205 -1.5378 -1.5607 8.1277 -6.2116
hfenergy: -668.9295382 hartree
pointgroup: C01 [X(C13H17N3)]
dipole: 0.0893591 1.3709376 -0.3334685 debye
polarizability: 169.7772609|-17.6141506|165.6596081|-16.3649478|-8.3827928|125.8713375 unknown
InChI: InChI=1S/C13H17N3/c1-10(11-5-3-2-4-6-11)13-15-9-12(16-13)7-8-14/h2-6,9-10,16H,7-8,14H2,1H3
charge 0 multiplicity 1
33 atoms
N  1.188868 -0.323933 0.634309
N  1.154897 -2.555342 0.32948
N  4.625054 2.183318 -1.112787
C  -1.066797 -1.479714 1.013623
C  0.400255 -1.475538 0.629269
C  -1.770317 -0.165097 0.656146
C  2.511551 -0.681044 0.317242
C  -1.785363 -2.704853 0.385788
C  3.623698 0.320982 0.188462
C  2.459088 -2.067257 0.13648
C  3.522504 1.204105 -1.086539
C  -2.495447 0.55599 1.637541
C  -1.741381 0.339883 -0.671725
C  -3.180912 1.748289 1.306037
C  -2.423264 1.529828 -1.006925
C  -3.146849 2.239536 -0.018558
H  -1.123695 -1.59749 2.116931
H  0.8469 0.620718 0.811788
H  -1.810348 -2.621219 -0.714771
H  -2.823539 -2.768937 0.756498
H  -1.241542 -3.629303 0.639916
H  3.668828 1.000351 1.061728
H  4.58395 -0.228787 0.166363
H  3.276878 -2.737294 -0.121498
H  2.568655 1.765829 -1.064402
H  3.477309 0.530661 -1.975575
H  -2.526089 0.178519 2.667576
H  -1.183409 -0.205707 -1.442778
H  -3.737757 2.290474 2.078678
H  -2.394393 1.903542 -2.036937
H  -3.677133 3.16237 -0.279012
H  4.507662 2.943494 -1.788553
H  5.557238 1.760921 -1.170098
