program: Gaussian 09
title: 000184123
version: EM64L-G09RevD.01
frameworkgroup: C1[X(C8H10Cl2NO3P)]
method: RPBEPBE
basis: SDD
operation: Freq
keyword: #p
keyword: freq=noraman
keyword: PBEPBE/SDD
title: #p freq=noraman PBEPBE/SDD
converged: YES YES NO NO
title: Mulliken charges:
elementType: Cl Cl P O O O N C C C C C C C C H H H H H H H H H H
charge: -0.031402 -0.041076 1.398942 -0.558722 -0.480256 -0.582927 -0.968197 0.535791 -0.224795 -0.337407 -0.282263 -0.655895 -0.084665 -0.186809 -0.237733 0.234312 0.218971 0.320136 0.209234 0.233579 0.238464 0.261381 0.263383 0.386066 0.371888
chargesum: 0.00000
title: Mulliken charges with hydrogens summed into heavy atoms:
elementType: Cl Cl P O O O N C C C C C C C C
charge: -0.031402 -0.041076 1.398942 -0.558722 -0.480256 -0.582927 -0.210243 0.535791 0.228488 -0.337407 0.037873 0.025382 -0.084665 0.074573 0.025650
polarizability: 1.79031653e+02 -1.58424154e+01 1.58341448e+02 1.76503438e+01 2.10618183e+00 9.65644971e+01
1716.lowfreq: -9.4432 -0.0032 -0.0021 -0.0020 0.9903 4.8916 12.4282 29.7879 50.2506
frequency: 10.9529 29.6479 50.1481 72.8873 78.7649 92.0842 126.9408 151.0927 166.9918 186.6793 212.7373 235.2208 261.5942 281.2160 299.2188 309.2468 320.1718 337.5545 362.4999 423.8015 440.2214 442.9597 470.2250 501.4224 561.0792 586.4845 626.5449 662.3827 698.9863 718.8992 799.2687 813.5235 839.2038 879.5800 885.6455 888.0723 934.7315 952.7214 1012.4820 1020.3639 1075.4447 1087.1397 1108.2623 1132.8689 1134.0484 1221.0467 1252.9692 1255.5167 1357.4183 1364.8632 1381.9047 1396.2124 1456.1765 1457.0903 1478.6777 1491.3870 1555.2719 1565.5310 1591.6882 2988.0185 2997.2270 3053.4054 3093.4255 3113.1516 3162.1772 3165.0282 3185.4201 3548.5187 3700.0119
redmass: 6.2530 3.8982 2.8423 8.3666 2.7575 10.4338 4.2987 5.4069 5.7731 5.2343 2.5360 1.4113 3.5006 4.7341 6.3789 9.8637 1.9773 5.5295 7.4801 4.1252 3.5167 3.2359 8.2762 1.7405 6.7438 6.2802 7.7362 5.9599 4.1679 8.5177 1.3327 1.0885 5.1884 3.4015 2.5036 2.9482 1.3371 1.5099 2.7787 5.8719 2.7200 2.9473 2.4939 1.4151 1.4163 3.2693 1.1526 1.3281 1.2549 6.9031 4.3154 1.2392 2.6000 1.0453 1.0499 1.0844 1.1081 6.8307 8.3004 1.0545 1.0382 1.1083 1.0979 1.1021 1.0942 1.0892 1.0976 1.0443 1.1030
irintensity: 2.1023 0.3789 1.5906 2.8230 4.4560 0.3685 0.0801 0.5093 0.6505 6.2117 2.0524 0.4666 3.9469 8.5166 1.7041 0.6445 0.4849 13.4990 44.6459 20.8467 21.6174 22.0341 5.7745 267.1131 33.3222 20.8355 20.0034 133.9512 1.7588 69.2595 40.2784 3.0896 96.9264 177.2566 131.9140 241.1364 0.7749 61.8240 45.2408 126.5068 13.2586 98.6267 51.4792 12.2428 7.7385 124.8708 2.2883 8.5394 4.4842 16.6819 56.1373 23.2047 189.4359 5.9400 5.0766 9.7409 78.9304 33.2548 61.8745 22.0762 22.4961 13.2423 23.0788 31.2209 5.7896 1.0966 1.0736 75.2926 71.3503
temp: 298.150 k
press: 1.00000 atm
elementType: 17 17 15 8 8 8 7 6 6 6 6 6 6 6 6 1 1 1 1 1 1 1 1 1 1
symmnumber: 1
zpe: 455263.7 jmol-1
zpe.correction: 0.173401 hartree
zpe.thermalcorrener: 0.190539 hartree
zpe.thermalcorrenthalpy: 0.191483 hartree
zpe.thermalcorrgfe: 0.125687 hartree
zpe.sumelectzpe: -1851.473352 hartree
zpe.sumelectthermal: -1851.456214 hartree
zpe.sumelectthermalent: -1851.455269 hartree
zpe.sumelectthermalfe: -1851.521065 hartree
dipole: -3.1810 3.7489 -0.6911
dipole: 4.9649
quadrupole: -90.9435 -118.6387 -105.8394
quadrupole: 5.1600 6.1803 5.7852
quadrupole: 14.1971 -13.4982 -0.6989 5.1600 6.1803 5.7852
hfenergy: -1851.6467525 hartree
pointgroup: C01 [X(C8H10Cl2N1O3P1)]
dipole: 0.7982176 -1.3518022 1.1623517 debye
dipolederiv: -0.2365012 0.1930894 -0.1469475 0.1877311 -0.4044235 0.2592058 -0.1641094 0.2785 -0.2621922 -0.2996022 0.2289068 -0.1527226 0.2996018 -0.4385796 0.290664 -0.2022145 0.2856903 -0.2835612 2.6932282 -0.0860035 -0.1218235 0.4751634 1.6532494 0.4166473 -0.1352711 0.1680051 2.1344885 -2.2185494 -0.059486 0.2118662 -0.1091284 -0.4809817 -0.056591 0.5682935 -0.0145655 -0.5556129 -0.763004 0.0028201 -0.203925 -0.1038054 -0.4305859 0.0826948 -0.4340568 -0.0679028 -1.3812942 -0.750213 -0.0291932 0.0511046 -0.0589847 -0.5934941 -0.0076418 0.0347906 0.0069061 -0.7240904 -1.0176296 0.2253002 -0.0595475 0.2804347 -0.8085642 -0.2781238 -0.1495495 -0.1609581 -0.9708841 1.5176782 0.0865495 -0.3024438 -0.5091953 -0.0060476 0.1198044 -0.2875163 0.0414261 0.1624731 0.4574559 -0.0250067 0.1702112 -0.1586065 0.1706963 -0.334103 0.2506099 0.0150646 0.7839698 -0.0815736 -0.3276629 0.2324526 -0.3639511 0.4773911 -0.4233239 0.3004594 -0.4551567 0.2476931 -0.3791181 0.0517504 -0.0041989 0.2974279 -0.2119881 0.0412529 -0.1671277 0.1056465 -0.1704553 0.0191474 -0.0178423 -0.0593737 0.0152135 0.0245223 -0.01644 -0.0726671 -0.0963447 -0.1332611 0.4469466 -0.3590708 0.167914 -0.4940408 0.623645 -0.5257597 0.2934096 -0.5249 0.3972794 0.0624373 -0.0140952 -0.0309801 0.0089615 -0.093845 -0.0034892 -0.0581471 0.0341848 -0.0671782 -0.1281663 0.0376518 -0.077224 0.0887693 -0.2377212 0.101125 -0.0960617 0.0937993 -0.2008979 -0.0450835 -0.0888606 0.0221181 -0.0325871 0.00055 0.0768506 -0.0021873 0.0068101 -0.0238362 -0.0624575 0.1036662 -0.0113205 0.118669 -0.0202573 0.0328179 0.0282446 -0.048507 -0.0150583 0.1558047 0.0029107 0.0467033 0.0053248 0.1214727 0.0444799 0.0321744 0.0399227 0.1224792 0.0953403 0.0137379 -0.0616384 0.0217705 0.023902 0.0847113 -0.082632 0.0656925 -0.1126822 -0.0432716 -0.1017308 0.0366686 -0.1116099 0.0226192 -0.0105448 0.0767807 0.0450524 0.0904644 -0.0364788 0.1103373 0.0474463 0.0807274 0.0126734 -0.0543065 0.0251081 -0.0131319 0.1056466 0.066222 -0.0102391 0.0467214 -0.0100694 0.0873957 0.08326 0.0589288 0.0789582 0.0585556 -0.0134583 0.0469755 0.0324735 0.0550118 0.114982 0.0339196 0.026168 0.0343397 0.1271713 0.2617386 0.0261938 0.098663 -0.0351046 0.215274 0.0368413 0.0995748 0.0215556 0.3288145 0.2991078 -0.0106983 0.0678029 0.0522766 0.1781149 0.0060487 0.0569981 0.0599127 0.3419687 unknown
polarizability: 170.0227422|-23.8472153|129.6478954|4.3106923|-36.4998956|134.2669606 unknown
InChI: InChI=1S/C8H10Cl2NO3P/c1-2-13-15(11,12)14-8-5-6(9)3-4-7(8)10/h3-5H,2,11H2,1H3
charge 0 multiplicity 1
25 atoms
Cl -0.579613 -2.360997 1.652122
Cl -3.395646 2.25972 -1.808626
P  1.996178 0.251389 -1.015075
O  0.661899 -0.843646 -0.605746
O  2.321742 1.042175 0.481725
O  1.783208 1.316436 -2.167601
N  3.100912 -1.021377 -1.288464
C  -0.645441 -0.406984 -0.351896
C  2.662624 0.237274 1.698045
C  -1.380495 -1.065569 0.663438
C  -1.262913 0.614921 -1.115111
C  3.005384 1.253134 2.783016
C  -2.599624 0.94621 -0.833286
C  -2.721507 -0.726303 0.919257
C  -3.346938 0.292985 0.16661
H  1.790524 -0.385415 1.972662
H  3.519649 -0.42221 1.46056
H  -0.697829 1.128117 -1.899444
H  3.265584 0.726209 3.719847
H  3.863412 1.875718 2.478858
H  2.145963 1.915326 2.980573
H  -3.274421 -1.249105 1.704589
H  -4.386956 0.567539 0.359156
H  2.829631 -1.979558 -1.070826
H  3.928274 -0.86839 -1.860783
