program: Gaussian 09
title: 000184144
version: EM64L-G09RevD.01
frameworkgroup: C1[X(C23H30N2O4)]
method: RPBEPBE
basis: SDD
operation: Freq
keyword: #p
keyword: freq=noraman
keyword: PBEPBE/SDD
title: #p freq=noraman PBEPBE/SDD
converged: YES YES NO NO
title: Mulliken charges:
elementType: O O O O N N C C C C C C C C C C C C C C C C C C C C C C C H H H H H H H H H H H H H H H H H H H H H H H H H H H H H H
charge: -0.288873 -0.426240 -0.223413 -0.271131 -0.094852 -0.492270 -0.151172 -0.287445 0.218769 0.022177 -0.058247 -0.648214 -0.550238 0.242479 -0.444146 -0.438819 -0.413415 0.079285 0.179268 -0.560588 0.182329 -0.721327 0.165149 -0.592612 -0.348389 -0.508529 0.303798 -0.354450 -0.536637 0.234112 0.276782 0.246519 0.274314 0.241315 0.182452 0.230150 0.217144 0.220168 0.208357 0.207838 0.203605 0.199530 0.226626 0.214638 0.209653 0.327557 0.223353 0.217357 0.212920 0.330821 0.239163 0.232187 0.241351 0.237342 0.242289 0.246282 0.241514 0.215980 0.216433
chargesum: 0.00000
title: Mulliken charges with hydrogens summed into heavy atoms:
elementType: O O O O N N C C C C C C C C C C C C C C C C C C C C C C C
charge: -0.288873 -0.095418 -0.223413 -0.271131 -0.094852 -0.164713 0.082940 -0.010663 0.218769 0.268695 0.124205 -0.132585 -0.102945 0.242479 -0.015621 -0.027376 0.012741 0.079285 0.179268 -0.136297 0.182329 -0.067695 0.165149 -0.353449 -0.116202 0.212453 0.303798 -0.108168 0.137290
polarizability: 3.78774380e+02 8.99716761e+00 2.84844208e+02 -2.16765489e+00 -9.46812642e+00 1.81943927e+02
1716.lowfreq: -10.5148 -5.3469 -0.0006 -0.0003 0.0003 3.4605 20.9141 35.9547 46.5587
frequency: 20.8370 35.9540 46.5435 60.3413 65.6457 76.5114 82.2144 87.6323 92.9288 106.2309 122.5402 138.5981 142.7569 174.3823 183.7384 193.5627 200.7182 219.3524 225.9357 238.1659 243.8465 248.2390 261.0821 284.2337 294.3740 300.4661 319.9972 331.6547 358.6398 372.0998 391.7492 400.8338 405.8973 421.3127 426.8351 444.6646 459.8543 483.0554 491.5117 500.5519 512.3229 537.9944 555.4717 589.1771 599.1349 619.0228 646.1801 670.8115 682.5408 692.7649 708.6176 733.6721 744.6370 749.7404 759.2870 783.6786 801.9525 807.1590 817.2872 838.0936 850.1120 880.9077 894.7233 907.6860 913.2644 929.1460 933.0171 937.3073 949.7490 962.1557 967.7163 983.2655 996.5121 1000.3551 1011.5329 1024.5743 1039.4298 1049.2848 1067.4609 1081.5886 1091.8054 1103.4345 1111.7571 1113.9532 1118.1304 1121.3095 1124.0470 1136.2463 1143.3066 1145.4870 1156.6868 1162.3526 1173.7326 1185.5187 1196.3032 1217.4287 1222.3028 1229.3373 1242.1516 1249.1347 1255.9871 1259.3905 1269.3624 1292.7084 1299.9268 1303.0402 1309.7214 1313.8763 1319.2005 1323.9281 1328.2212 1345.5830 1350.7152 1354.7301 1358.5228 1364.8374 1371.6634 1377.1213 1387.4835 1415.5508 1418.6962 1427.3410 1444.2598 1450.8124 1454.0473 1457.6467 1458.6382 1464.1326 1464.4438 1465.3385 1466.7654 1471.3268 1476.4663 1476.5249 1478.0866 1478.4458 1485.5071 1555.7170 1593.8703 1616.8443 1631.5240 2858.7120 2941.4626 2948.3582 2956.4763 2969.5269 2970.3827 2976.1107 2986.1647 2989.9680 3001.5752 3004.9374 3008.7343 3027.1909 3031.1305 3036.8454 3037.6853 3046.8278 3050.2092 3068.0619 3070.6714 3071.9608 3102.1417 3117.5237 3125.1164 3135.7239 3148.0520 3153.2544 3171.0559 3555.1682 3601.5759
redmass: 4.6853 4.1251 4.5362 4.3005 2.9401 3.0576 2.6760 3.4989 2.1165 1.8309 3.6400 3.8679 3.7825 3.3661 2.2850 4.8524 3.2524 2.6376 3.1476 1.6964 2.4801 2.1215 1.5543 1.4893 3.4272 3.3931 2.7879 2.7452 3.1261 2.9637 3.6022 3.5969 4.8536 4.0842 2.5459 3.0372 3.7883 3.2418 1.8497 2.3078 3.9181 3.5495 3.7031 4.2689 4.0971 3.5227 4.0459 6.4026 4.3184 5.3196 4.6848 2.7146 2.7732 3.2785 5.1824 1.5518 1.5253 2.7648 3.2041 1.7492 3.1236 2.6292 3.5762 3.0517 3.2565 2.3323 1.3333 2.2106 2.8742 3.0073 3.6635 2.2392 4.4242 2.6059 2.1217 2.2807 2.4605 2.9238 2.2118 2.3489 1.7736 2.2164 1.2776 1.2625 2.2271 2.1305 1.9168 2.1090 1.5548 1.5229 1.4361 2.9680 2.2529 1.2826 2.5781 1.3599 1.4483 1.5522 2.4970 1.4060 1.4231 1.5190 1.2227 1.6324 1.2963 1.5231 3.7529 1.3016 1.5486 1.5149 1.3960 1.4504 1.3096 1.2983 1.3830 1.3543 1.3808 1.4009 1.2176 5.6549 1.1879 1.4564 1.9050 1.0639 1.1056 1.1038 1.2828 1.0560 1.0875 1.0957 1.8363 1.0952 1.0785 3.2213 1.0705 1.2643 1.0628 7.3829 6.5607 9.3531 7.2280 1.0805 1.0667 1.0335 1.0718 1.0632 1.0358 1.0822 1.0637 1.0602 1.0298 1.0623 1.0906 1.0845 1.1034 1.0983 1.1008 1.0932 1.0969 1.1005 1.1026 1.0998 1.1043 1.0985 1.0904 1.0894 1.1048 1.0904 1.0954 1.0660 1.0795
irintensity: 0.4971 0.2273 0.9002 1.8097 1.4099 0.9456 1.0011 0.7607 2.2338 2.2030 2.7360 0.0961 3.2394 0.5259 0.6004 8.3090 2.1073 0.8998 3.5855 2.9966 15.4030 19.8543 3.2946 88.7439 4.4661 7.1696 18.3140 14.6280 6.1265 23.6887 2.5631 0.9320 5.3754 5.5728 4.1321 10.8108 3.1089 4.6454 17.2108 60.9791 16.6225 4.9192 2.5659 0.8381 12.2648 12.0218 7.2521 1.0989 8.8598 6.1324 3.5705 10.0870 2.6032 2.4902 3.1983 6.9929 44.9944 22.6186 17.2038 29.8655 8.9066 0.9922 20.0597 35.9667 12.9136 6.1510 0.0259 28.5679 64.2776 12.9482 15.4363 102.1918 13.5810 36.5141 8.6277 4.1871 17.1068 68.6791 14.8347 41.5053 10.5473 44.5851 0.5466 0.1476 32.1871 57.1120 53.6237 26.6858 10.2893 9.1256 1.8539 35.2304 37.6013 10.1198 152.4443 4.0999 22.1548 7.1344 32.5074 7.3301 31.5865 5.7540 6.6020 28.2877 3.1551 18.0852 2.8207 6.4360 15.3111 18.6519 0.5360 16.5913 2.7105 20.7900 1.6542 1.5285 1.7211 11.0111 11.1212 53.5972 20.3311 18.7856 19.6599 13.2954 6.0277 11.1134 1.6442 14.0457 3.8514 15.7350 76.2189 25.9015 4.7590 143.1369 15.1885 0.2835 12.5930 3.1313 57.6747 151.2897 62.5043 58.9062 31.4400 66.2197 36.4927 91.8067 30.8778 4.3469 26.7884 42.0572 39.1761 18.7865 45.6020 34.1814 55.2318 4.5966 25.7267 18.5917 29.8648 62.7884 27.4977 51.4006 22.9339 35.2028 20.7326 10.8316 12.6487 10.2459 9.3846 6.8451 55.5544
temp: 298.150 k
press: 1.00000 atm
elementType: 8 8 8 8 7 7 6 6 6 6 6 6 6 6 6 6 6 6 6 6 6 6 6 6 6 6 6 6 6 1 1 1 1 1 1 1 1 1 1 1 1 1 1 1 1 1 1 1 1 1 1 1 1 1 1 1 1 1 1
symmnumber: 1
zpe: 1294538.0 jmol-1
zpe.correction: 0.493063 hartree
zpe.thermalcorrener: 0.520713 hartree
zpe.thermalcorrenthalpy: 0.521657 hartree
zpe.thermalcorrgfe: 0.435786 hartree
zpe.sumelectzpe: -1302.640681 hartree
zpe.sumelectthermal: -1302.613031 hartree
zpe.sumelectthermalent: -1302.612087 hartree
zpe.sumelectthermalfe: -1302.697959 hartree
dipole: -0.4104 -0.0588 1.5254
dipole: 1.5807
quadrupole: -194.6337 -148.5360 -174.7524
quadrupole: 14.6799 1.8662 4.7957
quadrupole: -21.9930 24.1047 -2.1117 14.6799 1.8662 4.7957
hfenergy: -1303.1337444 hartree
pointgroup: C01 [X(C23H30N2O4)]
dipole: 0.1594375 -0.0383412 -0.599904 debye
polarizability: 378.1551194|-11.7609372|285.7559294|-2.1050007|7.7437237|181.6514656 unknown
InChI: InChI=1S/C23H30N2O4/c1-4-13-9-20-23(22(27)29-3)11-17(13)19(12-26)25(20)8-7-15-16-10-14(28-2)5-6-18(16)24-21(15)23/h5-6,10,13,17,19-20,24,26H,4,7-9,11-12H2,1-3H3
charge 0 multiplicity 1
59 atoms
O  -0.618679 2.906976 -0.921646
O  -4.003171 -3.601711 0.910506
O  -1.959398 2.869032 0.973581
O  6.463649 -1.036275 0.023701
N  -1.579111 -1.376304 -1.00008
N  1.541869 1.570606 0.391506
C  -2.767395 -0.756917 1.072263
C  -1.631213 0.092946 -1.071216
C  -0.872369 0.757725 0.18511
C  -3.750595 0.207466 0.336829
C  -2.266035 -1.94204 0.197128
C  -1.502388 0.067598 1.461515
C  -3.12173 0.518923 -1.061346
C  0.635458 0.535249 0.092303
C  -0.344301 -2.055819 -1.442469
C  -5.233234 -0.235455 0.270082
C  -3.31599 -2.989077 -0.239467
C  -1.210272 2.255165 0.178541
C  1.368533 -0.643163 -0.138151
C  0.84756 -2.026446 -0.448324
C  2.772742 -0.307263 0.013416
C  -6.160919 0.909123 -0.196896
C  2.852225 1.08924 0.329701
C  3.969383 -1.071157 -0.096622
C  4.087778 1.746384 0.521802
C  -1.017746 4.323248 -1.117496
C  5.199416 -0.410963 0.100339
C  5.261353 0.984335 0.403853
C  6.482339 -2.464621 -0.279167
H  -3.2426 -1.163935 1.984306
H  -1.129087 0.423767 -1.997145
H  -3.744494 1.142875 0.932019
H  -1.773554 0.845464 2.196373
H  -0.745637 -0.590254 1.925775
H  -1.527035 -2.490943 0.832635
H  -3.630008 -0.062179 -1.85382
H  -3.225147 1.588677 -1.321264
H  -0.029222 -1.590282 -2.395593
H  -0.595776 -3.112959 -1.662987
H  -5.551099 -0.58224 1.273476
H  -5.362622 -1.100349 -0.406306
H  -2.818664 -3.764219 -0.861683
H  -4.11338 -2.535109 -0.842688
H  1.666248 -2.628822 -0.889813
H  0.561481 -2.558694 0.484653
H  1.284458 2.555346 0.405179
H  -5.896134 1.252001 -1.214827
H  -7.217526 0.584785 -0.217974
H  -6.086069 1.780947 0.480659
H  -3.33579 -4.09064 1.455861
H  3.92521 -2.139821 -0.32699
H  4.142384 2.813769 0.76207
H  -2.096893 4.384071 -1.338909
H  -0.419318 4.66605 -1.97312
H  -0.805087 4.917395 -0.21272
H  6.248551 1.434201 0.544934
H  7.546062 -2.745843 -0.290497
H  6.031228 -2.675243 -1.269732
H  5.950864 -3.050526 0.497534
