program: Gaussian 09
title: 000184056
version: EM64L-G09RevD.01
frameworkgroup: C1[X(C14H9ClFNO2)]
method: RPBEPBE
basis: SDD
operation: Freq
keyword: #p
keyword: freq=noraman
keyword: PBEPBE/SDD
title: #p freq=noraman PBEPBE/SDD
converged: NO YES NO NO
title: Mulliken charges:
elementType: Cl F O O N C C C C C C C C C C C C C C H H H H H H H H H
charge: -0.043027 -0.206344 -0.239254 -0.412834 -0.040761 -0.350803 0.428875 0.210099 0.224599 0.041340 -0.324949 0.254786 -0.356101 -0.337345 -0.242415 -0.382189 -0.208958 -0.219626 -0.188763 0.280165 0.257491 0.256982 0.262142 0.263534 0.364067 0.243605 0.233507 0.232178
chargesum: 0.00000
title: Mulliken charges with hydrogens summed into heavy atoms:
elementType: Cl F O O N C C C C C C C C C C C C C C
charge: -0.043027 -0.206344 -0.239254 -0.048767 -0.040761 -0.070638 0.428875 0.210099 0.224599 0.041340 -0.324949 0.254786 -0.098610 -0.080364 0.019727 -0.118655 0.024549 0.012552 0.054842
polarizability: 2.25516726e+02 -1.35749403e+01 1.63424428e+02 -3.58516529e+00 1.55762440e+01 1.21846724e+02
1716.lowfreq: -8.7626 -0.5245 0.0014 0.0015 0.0025 5.3867 21.4736 29.3294 44.1135
frequency: 21.2982 29.3046 44.0952 93.0379 106.6674 167.8586 184.3177 209.3116 225.5322 249.9178 254.7426 295.8863 333.7257 381.1939 405.4047 419.3210 438.7028 452.8170 482.9902 504.7222 539.4456 550.6651 558.2237 576.3462 610.3650 661.7465 675.5334 718.6404 752.4113 754.9531 766.7841 778.1338 786.1938 828.1082 858.0760 864.7263 870.7121 885.5574 888.0050 945.7861 950.7051 966.2297 983.8196 1001.9499 1058.2212 1072.8994 1101.9602 1124.3991 1156.0724 1166.3118 1171.7147 1182.4834 1210.0748 1232.2586 1261.0501 1280.6065 1330.0864 1377.8124 1394.7407 1402.8596 1431.3880 1433.0901 1445.2959 1460.5627 1530.2225 1576.5560 1608.5659 1614.0007 1620.4587 3083.1034 3140.7630 3157.2612 3158.0908 3176.4324 3178.5210 3183.7700 3189.6255 3531.1436
redmass: 6.5395 8.3735 5.8585 7.8414 9.1359 7.6839 9.0642 5.4615 6.4671 7.9318 6.3069 7.6840 9.3388 7.1168 5.3255 6.1431 3.6108 1.3649 3.0102 6.2448 5.3157 7.0720 5.1275 3.8190 7.0940 6.5224 5.6983 4.3386 2.9896 2.1741 1.9886 2.9941 2.5170 7.0331 7.3936 1.4156 8.0618 1.3817 7.6728 1.4187 6.8735 1.3282 1.3090 2.0669 2.1338 3.7434 1.9705 3.4749 1.2886 1.6179 2.2977 1.4265 2.3437 2.8263 1.3697 1.4790 1.9572 3.2451 1.5539 3.0779 2.6043 2.8163 3.3260 2.6881 9.5015 6.9327 7.7082 8.7502 7.9712 1.0844 1.0865 1.0879 1.0916 1.0960 1.0933 1.0989 1.0994 1.0656
irintensity: 0.9780 0.0545 2.1069 0.0799 0.3626 0.9429 0.8958 0.4257 2.1503 2.0302 0.5024 2.3918 4.8811 3.6536 19.9596 1.2577 9.2330 165.3487 88.9906 24.0291 0.2342 1.3557 3.2385 0.1611 0.7307 15.3216 2.5094 19.0895 45.2619 35.5507 45.6712 43.4018 40.6454 36.7200 54.0683 0.1152 29.1296 0.3735 63.1409 1.0262 96.2810 0.2515 0.0023 11.2710 1.8579 29.7421 25.6033 13.7235 4.5566 40.9916 12.7379 38.9089 16.5491 23.6816 30.2913 2.7859 2.2399 6.7530 20.4474 8.1054 30.2133 46.5104 13.5791 5.4444 13.8077 49.2015 2.4585 40.2218 1.8279 0.2165 3.3429 4.6657 13.5489 9.2497 1.9000 10.6377 3.3826 30.9987
temp: 298.150 k
press: 1.00000 atm
elementType: 17 9 8 8 7 6 6 6 6 6 6 6 6 6 6 6 6 6 6 1 1 1 1 1 1 1 1 1
symmnumber: 1
zpe: 515090.3 jmol-1
zpe.correction: 0.196188 hartree
zpe.thermalcorrener: 0.211652 hartree
zpe.thermalcorrenthalpy: 0.212596 hartree
zpe.thermalcorrgfe: 0.151471 hartree
zpe.sumelectzpe: -1302.648790 hartree
zpe.sumelectthermal: -1302.633325 hartree
zpe.sumelectthermalent: -1302.632381 hartree
zpe.sumelectthermalfe: -1302.693506 hartree
dipole: 0.0776 -0.8621 -2.7794
dipole: 2.9111
quadrupole: -87.8363 -112.6394 -119.3521
quadrupole: -5.4292 -5.3075 2.1073
quadrupole: 18.7730 -6.0302 -12.7428 -5.4292 -5.3075 2.1073
hfenergy: -1302.8449772 hartree
pointgroup: C01 [X(C14H9Cl1F1N1O2)]
dipole: 0.1136278 -0.9613921 0.6120235 debye
polarizability: 221.7124036|20.7787209|165.4205532|-0.6441116|17.55329|123.6549209 unknown
InChI: InChI=1S/C14H9ClFNO2/c15-8-4-3-5-9(16)12(8)13(18)14-17-10-6-1-2-7-11(10)19-14/h1-7,13,18H
charge 0 multiplicity 1
28 atoms
Cl -2.405587 1.689267 2.310471
F  -1.768911 -1.169914 -2.02599
O  1.267935 1.827109 0.009242
O  -1.271006 1.550324 -1.93869
N  0.862836 -0.443547 -0.233442
C  -1.084694 1.198446 -0.521872
C  -2.08636 0.159815 -0.021562
C  0.332428 0.768243 -0.241412
C  2.495627 1.149765 0.177873
C  2.246559 -0.245282 0.028109
C  -2.761475 0.269273 1.217203
C  -2.410021 -0.991385 -0.77463
C  3.758417 1.689849 0.449854
C  3.305318 -1.16897 0.150406
C  -3.696906 -0.680587 1.672323
C  -3.331126 -1.968956 -0.379422
C  4.811343 0.752183 0.570875
C  4.589197 -0.647888 0.423615
C  -3.980078 -1.803445 0.864127
H  -1.256119 2.151443 0.003572
H  3.921993 2.764743 0.560346
H  3.129091 -2.242099 0.036487
H  -4.188972 -0.544528 2.638627
H  -3.523756 -2.828674 -1.026145
H  -1.152926 0.728497 -2.484732
H  -4.704888 -2.548756 1.20496
H  5.823196 1.113438 0.782829
H  5.437183 -1.333165 0.525473
