program: Gaussian 09
title: 000184031
version: EM64L-G09RevD.01
frameworkgroup: C1[X(C10H17NO5)]
method: RPBEPBE
basis: SDD
operation: Freq
keyword: #p
keyword: freq=noraman
keyword: PBEPBE/SDD
title: #p freq=noraman PBEPBE/SDD
converged: YES YES NO NO
title: Mulliken charges:
elementType: O O O O O N C C C C C C C C C C H H H H H H H H H H H H H H H H H
charge: -0.208730 -0.205619 -0.236573 -0.263983 -0.238884 0.007383 0.291911 0.301233 -0.423513 -0.741485 -0.748847 -0.732735 0.313251 0.212368 -0.728163 -0.734269 0.260092 0.254806 0.247722 0.238048 0.226824 0.249837 0.233054 0.225831 0.253558 0.223140 0.237257 0.230734 0.262988 0.235214 0.229848 0.245076 0.282624
chargesum: 0.00000
title: Mulliken charges with hydrogens summed into heavy atoms:
elementType: O O O O O N C C C C C C C C C C
charge: -0.208730 -0.205619 -0.236573 -0.263983 -0.238884 0.007383 0.291911 0.301233 0.091385 -0.028891 -0.040124 -0.018781 0.313251 0.212368 0.000773 0.023280
polarizability: 1.88762050e+02 6.91472680e-01 1.27678238e+02 9.52031195e+00 -6.24153401e-01 1.02155726e+02
1716.lowfreq: -14.4372 -9.3314 -3.7207 -0.0013 -0.0013 -0.0012 6.1811 27.0351 33.9174
frequency: -13.3113 26.9233 33.6965 47.4397 63.8528 87.3967 103.8585 116.1210 172.7641 173.2520 200.6229 241.3877 246.6264 254.1121 266.5633 287.8301 296.1060 301.5772 318.4112 341.0135 348.8427 367.9165 385.4448 451.0994 465.2037 476.6570 490.2024 565.7875 625.3204 644.0109 686.7160 697.6355 737.2827 799.6602 812.5650 826.6519 833.4229 882.7652 911.8117 936.0620 950.9766 960.5417 964.6296 974.0521 989.3675 1011.3464 1059.0068 1073.8272 1087.2902 1129.3163 1142.5174 1157.1185 1205.6924 1239.1024 1270.0234 1280.0623 1309.3387 1358.6366 1378.7016 1383.6997 1387.7957 1393.8773 1394.5032 1442.0763 1449.8494 1451.7092 1452.3004 1457.5578 1458.3660 1467.0868 1474.0527 1477.5225 1480.7090 1495.8358 1612.1920 1659.0842 2984.4323 2990.7274 2991.5390 2994.8881 2998.0127 3046.7101 3066.1200 3072.3174 3083.6526 3091.0679 3092.7453 3100.7952 3107.9362 3113.1499 3117.6543 3118.9834 3134.0046
redmass: 1.2889 2.2307 4.0186 4.2303 9.0211 4.7907 4.1283 4.0650 1.1685 1.1281 4.5606 2.1784 2.9979 1.7504 2.1481 1.3499 3.1667 3.8984 3.0290 2.2462 2.5260 3.1988 2.9919 2.3705 4.4839 2.8989 3.5444 7.1058 4.0824 4.4125 9.1613 6.4547 4.5297 5.3759 4.5225 7.5505 5.4389 5.7443 2.2635 1.4795 1.3525 1.8522 1.2961 1.5928 1.3370 5.6189 1.7954 2.4812 1.6947 4.1510 2.2897 2.3738 3.7748 1.8183 2.7249 4.4172 2.0805 1.2901 1.2702 1.2452 1.2209 1.2250 1.2035 1.0822 1.0908 1.0822 1.0562 1.0544 1.0507 1.0516 1.0494 1.0588 1.0669 1.0569 5.3248 10.9101 1.0371 1.0397 1.0353 1.0362 1.0361 1.0573 1.0977 1.0948 1.0990 1.0989 1.0988 1.1003 1.1008 1.0993 1.0993 1.1076 1.0988
irintensity: 0.4962 2.3144 0.2178 0.9561 1.0796 4.6774 2.3759 2.0876 0.5347 0.0733 3.2216 1.9657 7.7065 1.3807 5.0271 1.1374 1.7552 2.7793 10.2050 4.2577 3.2211 4.2425 4.2198 0.9738 2.7945 0.7133 0.8533 0.5058 6.8103 1.2529 15.2115 14.5910 15.2331 127.0804 42.3951 0.1999 153.6377 10.9876 4.7160 1.4537 0.4134 2.1136 1.3961 7.5376 0.0218 6.6201 269.7308 14.1086 10.5771 756.5391 25.0716 80.7100 48.6107 26.9137 6.5776 28.1358 3.9584 21.2677 28.9929 51.8764 45.1708 26.8186 19.0582 16.5115 20.7091 13.2763 4.9984 0.4741 12.4194 5.7190 34.7172 1.5579 18.2124 11.8896 39.7769 273.8433 10.6207 18.6806 11.7219 13.1047 7.8952 12.0634 7.0175 21.6139 3.6518 32.6563 15.3674 11.8596 13.8553 19.8875 9.6032 5.6088 4.3797
temp: 298.150 k
press: 1.00000 atm
elementType: 8 8 8 8 8 7 6 6 6 6 6 6 6 6 6 6 1 1 1 1 1 1 1 1 1 1 1 1 1 1 1 1 1
symmnumber: 1
zpe: 688505.4 jmol-1
zpe.correction: 0.262238 hartree
zpe.thermalcorrener: 0.280244 hartree
zpe.thermalcorrenthalpy: 0.281188 hartree
zpe.thermalcorrgfe: 0.215595 hartree
zpe.sumelectzpe: -820.716015 hartree
zpe.sumelectthermal: -820.698009 hartree
zpe.sumelectthermalent: -820.697064 hartree
zpe.sumelectthermalfe: -820.762657 hartree
dipole: 6.2949 0.2001 0.4357
dipole: 6.3132
quadrupole: -87.9491 -96.0179 -91.6384
quadrupole: -5.6979 4.7199 1.5773
quadrupole: 3.9194 -4.1495 0.2300 -5.6979 4.7199 1.5773
hfenergy: -820.9782525 hartree
pointgroup: C01 [X(C10H17N1O5)]
dipole: 2.4634934 -0.0852739 0.3052165 debye
polarizability: 187.7779586|-7.6399101|113.7429103|10.665689|12.3043298|117.0751454 unknown
InChI: InChI=1S/C10H17NO5/c1-7(2)11-14-8(12)13-6-10(5)9(3,4)15-16-10/h6H2,1-5H3
charge 0 multiplicity 1
33 atoms
O  -3.803124 -0.941972 -1.071776
O  -4.474774 -0.277782 0.182053
O  -0.07439 -0.60481 -1.365939
O  1.899682 -0.342338 -0.412954
O  0.082838 0.99622 0.346399
N  2.737071 0.34172 0.644516
C  -2.434562 -0.697176 -0.42039
C  -3.111451 0.36933 0.520022
C  -1.507052 -0.239125 -1.561599
C  -1.965483 -1.989539 0.251582
C  -3.126701 1.807477 -0.00403
C  -2.843902 0.296715 2.018766
C  0.584484 0.124527 -0.383904
C  3.98019 -0.074276 0.536053
C  4.918595 0.536126 1.557716
C  4.535985 -1.067895 -0.457336
H  -1.576943 0.843957 -1.747119
H  -1.780658 -0.794571 -2.474056
H  -2.79294 -2.412649 0.844273
H  -1.667948 -2.727581 -0.512777
H  -1.101151 -1.819285 0.917451
H  -2.127765 2.267911 0.089448
H  -3.457419 1.841591 -1.056646
H  -3.8447 2.400283 0.589507
H  -1.845772 0.718929 2.233053
H  -3.595646 0.897033 2.562286
H  -2.889367 -0.735282 2.399875
H  5.425373 -0.260761 2.133457
H  4.372597 1.192211 2.253424
H  5.703517 1.126421 1.049112
H  5.52649 -0.733664 -0.812918
H  4.679407 -2.047808 0.037979
H  3.861122 -1.214636 -1.312727
