program: Gaussian 09
title: 000184024
version: EM64L-G09RevD.01
frameworkgroup: C1[X(C15H24O2)]
method: RPBEPBE
basis: SDD
operation: Freq
keyword: #pfreq=noraman
keyword: PBEPBE/SDD
title: #p freq=noraman PBEPBE/SDD
converged: YES YES NO NO
title: Mulliken charges:
elementType: O O C C C C C C C C C C C C C C C H H H H H H H H H H H H H H H H H H H H H H H H
charge: -0.459288 -0.456786 -0.404977 -0.399766 -0.182536 -0.436651 0.301037 0.389039 -0.748651 -0.724577 -0.738702 0.162964 -0.416413 -0.550166 -0.460302 0.487616 -0.813882 0.237617 0.184684 0.192810 0.226715 0.195242 0.221826 0.175630 0.249890 0.205815 0.217368 0.226848 0.227553 0.207480 0.232843 0.218236 0.200872 0.232060 0.319904 0.214096 0.229235 0.228426 0.229069 0.225758 0.352064
chargesum: 0.00000
title: Mulliken charges with hydrogens summed into heavy atoms:
elementType: O O C C C C C C C C C C C C C C C
charge: -0.139384 -0.104722 0.017324 0.019759 0.012706 -0.039196 0.301037 0.389039 -0.075577 -0.062697 -0.086751 0.162964 -0.184353 -0.336070 -0.231067 0.487616 -0.130629
polarizability: 1.73572644e+02 2.91399666e+01 1.72850073e+02 -3.97165754e+00 2.65336620e+00 1.57641617e+02
1716.lowfreq: -0.0009 -0.0008 -0.0006 4.0035 8.6278 12.1258 23.0020 27.7056 31.3890
frequency: 22.8948 27.2084 31.2513 37.7863 78.4141 92.3539 119.7810 128.7504 186.3845 192.2266 202.9805 210.3058 211.2254 233.7521 239.3778 265.2126 286.1668 299.5605 318.7674 329.1665 354.0274 369.7827 405.9035 419.6718 434.2157 439.0799 463.1204 494.1643 509.1585 523.4168 573.5691 599.0604 686.0644 721.7391 734.9086 743.7976 746.1318 818.0296 841.7844 846.8788 860.7109 901.3941 923.8607 933.1501 949.7340 967.3512 971.2607 995.8803 1003.2085 1012.0077 1040.9352 1045.9089 1063.4851 1066.7198 1091.2072 1111.7091 1125.6340 1144.6987 1164.3791 1168.5406 1176.1224 1213.6552 1236.5620 1253.5657 1265.6400 1271.5935 1286.9187 1295.7722 1299.8261 1330.8988 1344.4194 1347.7347 1356.4508 1379.6189 1380.9311 1387.8638 1395.3929 1398.2587 1408.9332 1454.4976 1457.0299 1463.3978 1465.3939 1470.3101 1471.1653 1475.1389 1476.4241 1482.1378 1486.1402 1489.4891 1514.6845 1591.3871 1624.9412 2939.0983 2956.7130 2965.5902 2968.6162 2972.1597 2975.5491 2979.7398 2993.8458 3010.4572 3031.2558 3052.5451 3056.0945 3064.4189 3069.1425 3085.2858 3085.6422 3090.7491 3094.3950 3097.2320 3097.7809 3115.8448 3143.3747 3537.5099 3572.4542
redmass: 2.8287 1.2397 3.1268 3.9857 3.0032 3.7060 1.7014 2.9915 2.9972 1.8651 2.1170 3.0464 1.6122 1.2530 1.1312 3.1316 2.6956 2.3275 1.3969 2.2260 2.1530 1.3328 2.7321 2.9832 3.2542 2.5184 3.2134 3.0003 3.4431 4.5670 4.2501 3.2315 2.7269 6.3334 2.5219 3.4876 1.4056 1.2963 1.3816 1.4811 2.8819 1.9205 1.5294 2.7977 1.3690 1.5021 1.6724 1.8587 1.5584 2.0420 1.8518 1.5367 2.2058 1.9762 2.6603 1.7575 1.6903 1.6701 1.7420 1.4709 1.2729 1.8301 1.9562 1.3969 2.0384 2.3469 1.4569 1.2596 1.1964 1.4464 1.5559 1.6239 1.4857 1.3181 1.2661 2.9188 1.2609 1.3534 2.8649 1.0733 1.0500 1.0753 1.0627 1.0505 1.0459 1.0968 1.0894 1.0838 1.0591 1.0698 2.9071 5.9746 6.8551 1.0645 1.0822 1.0604 1.0632 1.0401 1.0374 1.0369 1.0356 1.0910 1.0971 1.0977 1.1009 1.0976 1.0994 1.0982 1.0996 1.0911 1.0998 1.0991 1.0995 1.0874 1.0963 1.0656 1.0658
irintensity: 0.5411 0.6559 0.3137 0.1278 0.3898 1.4788 0.1459 0.4409 0.8290 2.6837 0.4146 0.2281 2.5994 0.0543 4.4375 0.8494 4.9686 22.6862 80.4216 22.3147 34.1716 87.8538 12.4314 3.6953 6.4859 10.5929 14.9428 9.5748 1.1334 1.6908 4.6617 8.6221 7.7970 4.6645 2.5186 2.5498 3.2801 46.2824 10.6357 1.1761 24.8813 14.2868 1.9904 13.4258 0.8894 4.9184 9.1345 6.3292 0.9884 0.8441 10.8305 12.6892 4.9005 25.9349 4.1273 161.1939 53.5617 18.6073 16.0024 6.6902 8.3316 15.0678 32.9875 21.0292 13.1667 10.2931 28.2723 4.9839 9.2693 4.3807 9.0927 7.1576 9.4777 36.6403 22.8905 8.9491 19.1198 9.3470 31.7710 1.0895 0.5709 0.8237 3.0064 17.3994 12.5794 9.4932 9.6612 9.3782 15.4135 8.4481 26.8237 19.2890 23.8491 32.4858 21.3979 8.8356 56.5511 31.7388 44.1246 54.4931 12.0158 12.3896 20.0962 22.0600 53.9126 34.9065 53.3647 12.9023 15.7543 25.9601 37.3253 23.8809 44.7302 13.9128 20.1610 5.0834 21.6240
temp: 298.150 k
press: 1.00000 atm
elementType: 8 8 6 6 6 6 6 6 6 6 6 6 6 6 6 6 6 1 1 1 1 1 1 1 1 1 1 1 1 1 1 1 1 1 1 1 1 1 1 1 1
symmnumber: 1
zpe: 931218.9 jmol-1
zpe.correction: 0.354683 hartree
zpe.thermalcorrener: 0.374631 hartree
zpe.thermalcorrenthalpy: 0.375575 hartree
zpe.thermalcorrgfe: 0.305111 hartree
zpe.sumelectzpe: -735.108664 hartree
zpe.sumelectthermal: -735.088716 hartree
zpe.sumelectthermalent: -735.087771 hartree
zpe.sumelectthermalfe: -735.158235 hartree
dipole: -2.1046 0.0798 -0.2518
dipole: 2.1211
quadrupole: -107.7392 -105.3195 -97.8715
quadrupole: 13.2901 -12.1818 0.7000
quadrupole: -4.0958 -1.6761 5.7719 13.2901 -12.1818 0.7000
hfenergy: -735.4633461 hartree
pointgroup: C01 [X(C15H24O2)]
dipole: 0.829041 0.0255356 0.0917691 debye
polarizability: 173.0484903|-29.1895165|173.2730486|-3.9376579|-2.470751|157.742795 unknown
InChI: InChI=1S/C15H24O2/c1-11-7-8-13(14(16)10-11)12(2)6-5-9-15(3,4)17/h7-8,10,12,16-17H,5-6,9H2,1-4H3
charge 0 multiplicity 1
41 atoms
O  -5.111651 -0.604824 -0.882521
O  1.586152 1.175617 -1.967222
C  -0.790252 1.816983 -0.062564
C  -1.609959 0.574679 0.351433
C  0.5813 1.938552 0.666462
C  -2.981605 0.522643 -0.360696
C  -3.866943 -0.717494 -0.060216
C  1.499378 0.739316 0.420346
C  1.278346 3.280615 0.315209
C  -3.231213 -2.027691 -0.553957
C  -4.262484 -0.80581 1.430696
C  1.986205 0.378914 -0.868322
C  1.918801 -0.077771 1.496974
C  2.837964 -0.731724 -1.058553
C  2.772236 -1.192163 1.322166
C  3.245344 -1.537466 0.034123
C  4.161799 -2.72963 -0.182836
H  -0.617732 1.804556 -1.154778
H  -1.376634 2.732791 0.161538
H  -1.75267 0.583868 1.451861
H  -1.030161 -0.338305 0.115886
H  0.368412 1.949838 1.756703
H  -2.827379 0.562923 -1.457736
H  -3.557738 1.436111 -0.090314
H  1.504484 3.330263 -0.763234
H  0.621557 4.132782 0.573288
H  2.225359 3.394369 0.87359
H  -2.96339 -1.942127 -1.621538
H  -3.954107 -2.855071 -0.447039
H  -2.323278 -2.276595 0.022112
H  -4.986817 -1.626404 1.576553
H  -3.384706 -0.998931 2.07328
H  -4.731643 0.137282 1.773416
H  1.56222 0.170879 2.504224
H  -5.559496 0.248665 -0.646297
H  3.191766 -0.976867 -2.071013
H  3.068707 -1.794179 2.188615
H  3.717137 -3.45957 -0.885448
H  5.135437 -2.41962 -0.60757
H  4.362472 -3.256465 0.765575
H  1.990079 0.833459 -2.803298
