program: Gaussian 09
title: 000184017
version: EM64L-G09RevD.01
frameworkgroup: C1[X(C12H12N4S)]
method: RPBEPBE
basis: SDD
operation: Freq
keyword: #p
keyword: freq=noraman
keyword: PBEPBE/SDD
title: #p freq=noraman PBEPBE/SDD
converged: NO YES NO NO
title: Mulliken charges:
elementType: S N N N N C C C C C C C C C C C C H H H H H H H H H H H H
charge: 0.212965 -0.162279 0.018641 0.014264 0.002225 0.291208 -0.097469 -0.059282 0.053224 -0.351521 -0.199226 -0.331892 -0.634036 0.234967 -0.428615 -0.786683 -0.801464 0.241073 0.258010 0.250873 0.242016 0.249255 0.245699 0.229106 0.228534 0.258658 0.237303 0.286723 0.297723
chargesum: 0.00000
title: Mulliken charges with hydrogens summed into heavy atoms:
elementType: S N N N N C C C C C C C C C C C C
charge: 0.212965 -0.162279 0.018641 0.014264 0.002225 0.291208 -0.097469 -0.059282 0.053224 -0.110448 -0.199226 -0.073882 0.108108 0.234967 -0.182916 -0.070385 0.020286
polarizability: 2.88007520e+02 -6.24808159e+00 2.02753919e+02 -9.09358673e-01 5.38495124e-01 7.93067280e+01
1716.lowfreq: -5.1295 -0.0020 0.0017 0.0023 5.4876 8.6157 41.8538 51.4793 69.9040
frequency: 41.8524 51.4771 69.9018 77.6595 81.3861 102.8902 108.1119 128.7118 191.9055 195.2171 242.8390 246.8327 286.8209 313.2541 321.3322 343.9530 409.8695 451.7290 461.5322 487.3866 559.0348 563.7999 588.7781 623.0789 653.1211 654.8681 668.6114 706.6972 723.8327 735.8364 804.9818 820.7936 835.3736 906.1474 910.3401 955.9815 966.5156 988.3713 1002.8899 1029.7930 1045.9924 1048.6587 1092.7010 1120.6789 1133.4029 1199.0437 1210.2598 1252.7818 1279.0274 1301.8492 1317.9349 1338.7004 1349.3754 1379.1993 1385.3055 1390.2795 1402.5598 1432.7442 1442.7005 1452.1095 1456.1625 1464.3018 1466.2298 1472.9166 1483.6094 1490.8519 1530.0183 1576.7468 1603.2945 2980.9464 2989.3600 3029.9170 3058.1700 3077.0793 3106.4298 3117.1977 3120.2626 3143.8817 3158.2260 3165.9534 3172.4027
redmass: 3.0020 1.0754 2.7976 3.9547 1.1481 2.1343 1.7558 3.2333 3.8387 4.3113 5.2134 3.1994 3.9803 4.2643 6.7344 6.9921 5.3319 6.5753 5.2377 6.3017 5.1077 6.7530 3.3373 7.8955 9.3731 7.3984 5.7326 6.1646 3.4171 6.4545 2.2796 6.1149 3.7648 1.3302 5.3657 1.3298 1.8117 1.1732 1.2843 2.8182 1.5945 4.8728 2.1325 1.3225 1.5287 2.5327 5.3414 2.8501 3.2216 3.7740 5.1251 2.0774 1.8474 2.9464 2.5139 1.6415 3.8726 1.0521 1.6828 1.1349 1.2715 2.2959 1.0523 1.0460 1.7497 1.5548 5.6617 7.7738 8.2650 1.0382 1.0346 1.0277 1.0971 1.1020 1.1002 1.0978 1.0924 1.0886 1.1052 1.1060 1.0965
irintensity: 2.6921 2.1690 2.1658 5.8372 0.5384 0.3607 0.3612 0.1509 5.0210 4.4320 0.1942 0.1230 1.3783 2.8623 0.7065 1.3701 4.5021 2.1894 0.3530 7.8258 1.4195 2.6145 6.9609 0.4935 0.0656 6.0563 2.5713 6.2920 7.4635 5.0624 28.3190 0.8152 13.1102 15.1745 2.4892 0.9652 30.9996 6.9790 5.9125 6.1105 8.1726 35.8998 40.9153 5.4855 21.2160 1.6870 8.3524 16.4922 35.3186 8.2594 33.6049 78.2368 23.3830 36.5860 2.0218 23.0757 208.9252 15.4829 1.0615 21.9234 23.8792 22.1898 15.7130 19.3195 9.1533 63.7271 74.4974 8.8854 15.7887 21.8993 51.3969 21.2925 18.1033 19.0350 6.3705 5.8082 30.2385 5.0232 8.1406 6.1709 11.0743
temp: 298.150 k
press: 1.00000 atm
elementType: 16 7 7 7 7 6 6 6 6 6 6 6 6 6 6 6 6 1 1 1 1 1 1 1 1 1 1 1 1
symmnumber: 1
zpe: 577513.8 jmol-1
zpe.correction: 0.219963 hartree
zpe.thermalcorrener: 0.235958 hartree
zpe.thermalcorrenthalpy: 0.236902 hartree
zpe.thermalcorrgfe: 0.175295 hartree
zpe.sumelectzpe: -1080.343687 hartree
zpe.sumelectthermal: -1080.327693 hartree
zpe.sumelectthermalent: -1080.326748 hartree
zpe.sumelectthermalfe: -1080.388356 hartree
dipole: 2.5494 -1.1722 0.1980
dipole: 2.8130
quadrupole: -93.2128 -93.8200 -109.2123
quadrupole: -10.6263 0.7285 0.4079
quadrupole: 5.5355 4.9283 -10.4639 -10.6263 0.7285 0.4079
hfenergy: -1080.5636508 hartree
pointgroup: C01 [X(C12H12N4S1)]
dipole: -1.0108531 -0.4418446 -0.0881882 debye
polarizability: 288.1195224|4.4797825|202.203723|5.2133719|-6.0991228|79.7449219 unknown
InChI: InChI=1S/C12H12N4S/c1-7-6-13-8-4-5-9-11(10(8)14-7)15-12(17-3)16(9)2/h4-6H,1-3H3
charge 0 multiplicity 1
29 atoms
S  -4.191673 1.215334 -0.169558
N  -2.435267 -0.970116 -0.074688
N  -1.391858 1.075108 -0.106235
N  1.662189 1.352406 -0.042029
N  3.123415 -1.123988 0.091983
C  -1.054964 -1.228019 -0.019981
C  -0.42521 0.053902 -0.048025
C  1.003417 0.134327 -0.013726
C  1.733911 -1.123221 0.05311
C  -0.342372 -2.45566 0.046739
C  -2.568289 0.427892 -0.11579
C  1.051951 -2.386779 0.081981
C  -3.502884 -1.973534 -0.066328
C  3.01477 1.325175 -0.003944
C  3.732397 0.076044 0.063574
C  3.755383 2.642131 -0.034048
C  -3.609575 2.993093 -0.395216
H  -0.858668 -3.420736 0.073109
H  1.670486 -3.287524 0.134306
H  -4.451439 -1.501299 -0.368382
H  -3.273433 -2.776764 -0.787842
H  -3.630806 -2.415748 0.938225
H  4.828636 0.073847 0.094393
H  4.372627 2.776274 0.874312
H  4.437604 2.69949 -0.903087
H  3.030363 3.46805 -0.095542
H  -4.52534 3.603672 -0.391817
H  -3.070891 3.080817 -1.3484
H  -2.94308 3.258325 0.436005
