program: Gaussian 09
title: 000184053
version: EM64L-G09RevD.01
frameworkgroup: C1[X(C17H13ClFNO3S)]
method: RPBEPBE
basis: SDD
operation: Freq
keyword: #p
keyword: freq=noraman
keyword: PBEPBE/SDD
title: #p freq=noraman PBEPBE/SDD
converged: YES YES NO NO
title: Mulliken charges:
elementType: Cl S F O O O N C C C C C C C C C C C C C C C C C H H H H H H H H H H H H H
charge: -0.038420 0.225043 -0.170467 -0.240060 -0.230000 -0.206925 -0.023227 -0.274293 0.423349 0.208081 0.242486 0.032303 -0.317201 0.266003 -0.366563 -0.344366 -0.245390 -0.388424 -0.186166 -0.210145 -0.221447 0.016675 -0.611570 -0.620883 0.292125 0.257646 0.258267 0.261460 0.262396 0.242074 0.233583 0.232555 0.285710 0.254486 0.227018 0.254901 0.219387
chargesum: 0.00000
title: Mulliken charges with hydrogens summed into heavy atoms:
elementType: Cl S F O O O N C C C C C C C C C C C C C C C C C
charge: -0.038420 0.225043 -0.170467 -0.240060 -0.230000 -0.206925 -0.023227 0.017832 0.423349 0.208081 0.242486 0.032303 -0.317201 0.266003 -0.108916 -0.086099 0.016070 -0.126028 0.055908 0.023438 0.011109 0.016675 -0.071374 0.080422
polarizability: 2.66507327e+02 -5.52368342e+00 2.49604700e+02 -1.34243320e+01 -1.62703541e+01 1.82142327e+02
1716.lowfreq: -1.2949 -0.0011 0.0019 0.0024 3.5695 4.7800 10.1571 22.6511 34.7482
frequency: 8.3244 22.6458 34.7315 37.5619 44.2539 46.7468 64.1286 76.3694 102.4547 121.1712 151.7600 174.5571 187.9209 206.0642 221.4179 234.1346 255.1613 274.1943 276.7617 300.3423 327.5955 334.9752 385.0962 416.6926 438.0031 443.7890 466.9709 487.8184 507.6929 545.9975 553.6393 561.9119 575.9365 601.7458 606.5496 610.8157 660.1206 667.1627 702.6309 745.4704 754.9652 761.5497 766.7068 776.4331 787.2982 811.0705 843.1178 863.3863 864.6568 869.9678 878.7826 885.8890 915.1257 946.0632 968.2534 981.9991 983.9207 1002.0483 1032.1573 1060.7970 1062.4992 1073.2622 1090.3425 1111.6199 1134.5937 1158.1365 1171.1118 1183.1072 1197.2613 1230.4963 1236.9343 1255.3350 1280.8927 1282.2289 1309.4716 1337.6440 1388.4874 1396.6216 1402.2962 1432.9183 1433.5411 1437.2650 1453.7514 1460.6503 1467.3463 1481.7461 1544.3081 1578.8730 1611.3243 1611.6432 1613.6244 1621.0749 2985.9886 3024.4134 3036.6230 3079.1643 3095.6096 3121.6793 3141.3296 3155.5598 3158.6428 3176.9132 3178.4755 3184.0428 3188.7414
redmass: 5.1749 6.8219 7.1277 6.4774 6.5847 5.8039 5.7493 3.8827 10.8215 6.1340 3.5195 8.3608 6.7160 5.3945 4.9517 2.6124 6.2514 2.7106 3.0455 8.1801 7.6049 3.8427 9.7608 4.2317 5.1462 5.3069 9.6645 5.8302 7.3692 5.4544 7.6947 4.8923 3.8825 7.2518 7.7117 7.0904 6.7769 7.7562 4.9108 3.3119 2.0226 1.1896 1.9716 6.1051 1.8168 6.4306 9.2939 3.8704 1.8461 7.3586 7.7425 1.3907 8.1716 1.3810 1.3255 1.7854 1.3098 2.0587 7.7022 1.9776 1.4297 2.1635 2.8053 2.3960 2.4483 1.2643 1.9058 1.8995 1.9879 2.7838 2.2958 1.1851 1.4664 1.2245 1.2617 2.4446 3.8537 1.2060 4.1303 2.6950 1.1486 2.3965 3.6127 2.6880 1.0413 1.0457 10.1415 6.9408 9.2391 8.4190 9.0731 8.0125 1.0372 1.0826 1.0595 1.0964 1.1017 1.1060 1.0865 1.0879 1.0916 1.0960 1.0931 1.0989 1.0993
irintensity: 0.1065 0.3211 0.0150 0.1647 1.9562 1.6628 1.9079 0.6637 0.2037 0.6611 0.7094 0.4194 0.1351 2.4073 1.8994 7.9185 0.5471 7.2116 3.7261 3.4336 3.8572 1.2435 11.1939 11.3658 14.1827 8.3766 4.0837 2.3984 7.5720 0.1046 0.9620 4.4885 0.4806 10.9119 11.0932 0.7619 11.9774 19.2394 28.9232 7.8624 52.2739 9.3183 49.8678 18.8382 46.5668 51.1358 36.4614 18.3741 9.4426 88.5110 62.4135 1.5978 92.4534 3.6892 0.0726 128.3647 0.0013 12.0780 744.3975 1.3850 16.3204 16.6376 11.6773 38.3220 9.4444 4.6740 1.0082 8.6277 33.0175 15.4393 9.4272 1.9402 3.3091 12.0251 32.7264 4.7215 4.4884 19.5874 8.1194 22.4872 6.3605 64.3143 11.9973 5.0000 15.9572 9.4464 20.6107 32.9343 110.4715 39.9246 95.5651 3.6083 29.3594 34.4402 15.7327 29.6924 7.0217 15.7102 3.4045 5.8592 13.9478 9.0374 1.5132 11.1905 4.1466
temp: 298.150 k
press: 1.00000 atm
elementType: 17 16 9 8 8 8 7 6 6 6 6 6 6 6 6 6 6 6 6 6 6 6 6 6 1 1 1 1 1 1 1 1 1 1 1 1 1
symmnumber: 1
zpe: 686734.8 jmol-1
zpe.correction: 0.261563 hartree
zpe.thermalcorrener: 0.283721 hartree
zpe.thermalcorrenthalpy: 0.284665 hartree
zpe.thermalcorrgfe: 0.205756 hartree
zpe.sumelectzpe: -1892.279772 hartree
zpe.sumelectthermal: -1892.257615 hartree
zpe.sumelectthermalent: -1892.256671 hartree
zpe.sumelectthermalfe: -1892.335580 hartree
dipole: 0.3642 0.5122 0.0991
dipole: 0.6362
quadrupole: -127.6931 -124.4842 -158.5313
quadrupole: -3.5590 2.2882 -7.2835
quadrupole: 9.2098 12.4187 -21.6284 -3.5590 2.2882 -7.2835
hfenergy: -1892.5413355 hartree
pointgroup: C01 [X(C17H13Cl1F1N1O3S1)]
dipole: -0.133345 0.2115839 0.0104173 debye
polarizability: 256.6433382|8.9676859|250.8868794|2.8585204|-32.3456229|190.7241357 unknown
InChI: InChI=1S/C17H13ClFNO3S/c1-2-24-17(21)23-15(14-10(18)6-5-7-11(14)19)16-20-12-8-3-4-9-13(12)22-16/h3-9,15H,2H2,1H3
charge 0 multiplicity 1
37 atoms
Cl -2.192024 0.009403 2.807839
S  0.955494 -4.070575 -0.704118
F  -1.311494 -0.206206 -2.34693
O  1.990995 0.68869 0.272554
O  0.237234 -1.572142 -0.398628
O  0.195121 -2.784348 1.61911
N  0.288992 1.915208 -0.718257
C  -0.260233 -0.343653 0.331849
C  -1.72828 -0.125617 0.036903
C  0.610009 0.795792 -0.095492
C  2.55172 1.892726 -0.209502
C  1.50458 2.647393 -0.812385
C  -2.700802 0.023614 1.055102
C  -2.219155 -0.067728 -1.290932
C  3.881486 2.323877 -0.139083
C  1.779222 3.90843 -1.380121
C  -4.070746 0.205919 0.78393
C  -3.572174 0.109187 -1.61369
C  -4.501608 0.245451 -0.560196
C  4.14317 3.591259 -0.712139
C  3.113635 4.366882 -1.3198
C  0.399382 -2.714059 0.390432
C  1.171956 -5.402869 0.639069
C  2.495469 -5.261929 1.399444
H  -0.116745 -0.533346 1.412727
H  4.666334 1.723055 0.327024
H  0.985695 4.497439 -1.847954
H  -4.78118 0.317195 1.606752
H  -3.876833 0.140702 -2.662934
H  -5.563575 0.385371 -0.783978
H  5.164763 3.985007 -0.687791
H  3.367694 5.340967 -1.750603
H  0.303114 -5.309195 1.310052
H  1.102774 -6.351663 0.08068
H  3.361645 -5.313853 0.71732
H  2.532135 -4.303649 1.944359
H  2.590227 -6.078837 2.140288
