program: Gaussian 09
title: 000184002
version: EM64L-G09RevD.01
frameworkgroup: C1[X(C9H7Br2ClO)]
method: RPBEPBE
basis: SDD
operation: Freq
keyword: #p
keyword: freq=noraman
keyword: PBEPBE/SDD
title: #p freq=noraman PBEPBE/SDD
converged: YES YES NO NO
title: Mulliken charges:
elementType: Br Br Cl O C C C C C C C C C H H H H H H H
charge: 0.008869 0.017631 -0.097215 -0.104896 0.621720 -0.647269 -0.384399 -0.311015 -0.644517 0.422074 -0.357858 -0.305469 -0.181536 0.329660 0.243913 0.236052 0.297368 0.312846 0.276030 0.268012
chargesum: 0.00000
title: Mulliken charges with hydrogens summed into heavy atoms:
elementType: Br Br Cl O C C C C C C C C C
charge: 0.008869 0.017631 -0.097215 -0.104896 0.621720 -0.317609 -0.140486 -0.074963 -0.034303 0.422074 -0.081828 -0.037457 -0.181536
polarizability: 1.98047579e+02 1.99848395e+01 1.33260440e+02 1.44385007e-01 5.14388735e+00 1.21746849e+02
1716.lowfreq: -9.4439 -5.5323 -1.5453 -0.0020 -0.0016 0.0012 20.0439 27.8256 54.3040
frequency: 19.7474 27.7903 54.2927 72.7560 103.2725 123.3272 148.0376 176.5449 230.7859 258.2547 297.7962 377.9447 401.2468 426.9025 470.1406 487.9845 555.2246 607.8764 616.9533 633.2190 642.5307 745.3453 754.7492 848.9971 851.7341 865.1896 911.8163 984.9093 992.5936 1009.8818 1053.8399 1109.6583 1135.3292 1164.8888 1187.4173 1209.9392 1217.5450 1240.1743 1306.7031 1344.5424 1399.4379 1417.5469 1453.0183 1494.0395 1573.2466 1614.5332 1708.2336 3081.2054 3097.5405 3138.6032 3147.1264 3167.5281 3169.3825 3178.9092
redmass: 10.0560 19.9831 5.3589 11.6562 10.2956 10.6356 4.4595 25.2171 4.2214 7.9215 7.1033 11.3487 2.8161 4.9940 6.9471 3.8658 6.2021 5.0733 5.7353 4.3338 4.2815 4.2629 4.0417 1.4032 4.0779 1.6452 1.6279 1.3744 1.3910 3.0676 2.8198 1.3000 1.2187 1.2092 1.6405 1.6897 1.8096 1.3829 1.3561 2.0524 3.6157 2.6174 1.1158 2.4676 6.7016 6.2694 12.8811 1.0579 1.0868 1.0897 1.0898 1.0960 1.1111 1.0954
irintensity: 0.0362 0.3920 0.1755 2.2543 4.9198 2.3172 0.9246 2.0558 0.3408 4.9853 24.7061 13.0808 0.0347 8.4265 12.5840 5.0550 95.2909 29.2035 7.6743 26.6467 22.2949 103.9419 11.3298 26.9738 154.9623 34.2919 11.5584 2.3476 0.0863 1.3781 2.4236 1.3727 24.2502 5.5000 128.5331 72.4102 38.3279 11.2994 6.5308 17.8673 1.4826 23.4104 20.2300 4.5476 11.7830 42.9043 306.1750 3.4652 1.7158 5.4295 7.2573 2.8040 2.6868 1.9091
temp: 298.150 k
press: 1.00000 atm
elementType: 35 35 17 8 6 6 6 6 6 6 6 6 6 1 1 1 1 1 1 1
symmnumber: 1
zpe: 354742.0 jmol-1
zpe.correction: 0.135114 hartree
zpe.thermalcorrener: 0.148353 hartree
zpe.thermalcorrenthalpy: 0.149298 hartree
zpe.thermalcorrgfe: 0.090364 hartree
zpe.sumelectzpe: -908.438073 hartree
zpe.sumelectthermal: -908.424833 hartree
zpe.sumelectthermalent: -908.423889 hartree
zpe.sumelectthermalfe: -908.482822 hartree
dipole: -3.7232 -0.3431 -0.0260
dipole: 3.7390
quadrupole: -125.1836 -109.3923 -94.8171
quadrupole: -0.3327 -1.3784 -0.1724
quadrupole: -15.3860 0.4054 14.9806 -0.3327 -1.3784 -0.1724
hfenergy: -908.5731867 hartree
pointgroup: C01 [X(C9H7Br2Cl1O1)]
dipole: 1.4647369 0.088286 0.1035361 debye
dipolederiv: -0.4803724 -0.1284548 -0.0209172 -0.4229244 -0.7533539 -0.1711727 0.0120082 -0.149463 -0.1506499 -0.1459472 0.0195941 0.0196365 0.0909813 -0.6390542 -0.1528412 0.0465939 -0.121794 -0.1497231 -0.5350539 0.0492623 -0.3165541 0.1166485 -0.1689059 0.1533935 -0.5608365 0.1292873 -0.8290525 -0.927177 -0.1287882 0.2925769 -0.1046177 -0.2823922 0.1924973 0.2415253 0.1929864 -0.910849 -0.0077334 0.0382416 -0.008562 0.1152936 -0.0740119 -0.0337572 0.0100697 -0.0447522 0.0708469 0.8387174 0.1376644 0.0358989 0.3925287 0.8407918 0.1497408 0.025465 0.1782562 0.137006 -0.2861227 -0.0647843 0.2086646 -0.0578957 -0.1152996 -0.0267913 0.1037437 -0.038593 0.0367699 -0.2162653 0.0355955 -0.2164816 0.0715215 -0.0877099 -0.0353335 -0.1884145 -0.0088983 -0.0126691 -0.05084 -0.0186292 -0.0072419 -0.1288584 0.7782571 0.0906876 -0.0154903 0.157898 0.0896944 -0.975812 -0.0683182 -0.079762 0.0040063 0.0103951 0.0311881 -0.2739639 0.0117576 -0.1276988 0.1641533 0.0716598 -0.1864169 -0.0133326 -0.0618994 -0.0425498 0.2080798 -0.0205859 0.0285631 0.1702131 -0.0245311 0.1628415 0.0491538 -0.0853882 -0.0084908 -0.0972964 -0.021342 -0.0318753 2.1338976 0.1224844 0.1416808 -0.0182678 0.2736641 -0.3736256 0.5473309 -0.3419123 1.695318 0.0179518 -0.0248119 0.0316641 -0.0262109 -0.0508405 0.0497122 -0.0389408 -0.0024301 -0.0208179 0.0235226 0.0184263 -0.0965417 0.005475 0.1240355 0.0333345 -0.0781183 0.0288272 -0.0127174 0.028495 -0.0337903 0.0806648 -0.0507919 0.1178193 0.0307358 0.0924331 0.0216044 0.0008193 0.1290455 0.01014 -0.0650833 0.0164254 -0.0662562 0.0703397 -0.0329481 -0.0039475 -0.0088121 -0.0509883 0.0041223 -0.0010263 -0.026517 -0.0469417 -0.0154058 -0.0039563 -0.0197792 0.1042115 0.0669915 -0.0240493 0.0775367 -0.0164336 0.1443389 0.0322559 0.0375247 0.0276353 0.0507438 0.1033245 0.0089665 -0.0525778 0.0038158 0.1427519 0.0260824 -0.034809 0.0252454 0.0408921 unknown
polarizability: 198.3698359|17.3077945|134.0496116|9.5650318|-0.4111538|120.6354201 unknown
InChI: InChI=1S/C9H7Br2ClO/c10-5-8(11)6-1-3-7(4-2-6)9(12)13/h1-4,8H,5H2
charge 0 multiplicity 1
20 atoms
Br 3.252768 2.20293 0.506553
Br 3.223969 -2.410194 -0.729148
Cl -3.946193 0.300705 -1.627475
O  -3.89368 -0.364017 1.013158
C  1.159651 0.147817 0.286711
C  2.659797 0.202275 0.425551
C  0.374669 -0.177795 1.423884
C  0.508492 0.414959 -0.946066
C  3.501355 -0.392471 -0.6966
C  -1.671443 0.016194 0.091086
C  -1.025603 -0.247664 1.332431
C  -0.891664 0.350038 -1.047122
C  -3.151256 -0.077554 0.074985
H  2.988885 -0.173623 1.405971
H  0.866531 -0.382126 2.381644
H  1.094079 0.688963 -1.829746
H  3.219669 -0.037486 -1.697436
H  4.576698 -0.255549 -0.521126
H  -1.633033 -0.504651 2.205908
H  -1.389588 0.556452 -1.998261
