program: Gaussian 09
title: 000183993
version: EM64L-G09RevD.01
frameworkgroup: C1[X(C10H15NO)]
method: RPBEPBE
basis: SDD
operation: Freq
keyword: #p
keyword: freq=noraman
keyword: PBEPBE/SDD
title: #p freq=noraman PBEPBE/SDD
converged: YES YES NO NO
title: Mulliken charges:
elementType: O N C C C C C C C C C C H H H H H H H H H H H H H H H
charge: -0.428966 -0.371653 0.419906 0.392346 0.030765 -0.552590 -0.580090 -0.418674 -0.427015 -0.249471 -0.688634 -0.672335 0.210788 0.219038 0.225951 0.213947 0.233683 0.232667 0.223773 0.241044 0.210025 0.220999 0.215974 0.220617 0.230312 0.292032 0.355560
chargesum: 0.00000
title: Mulliken charges with hydrogens summed into heavy atoms:
elementType: O N C C C C C C C C C C
charge: -0.073407 -0.079620 0.419906 0.392346 0.030765 -0.122764 -0.140192 -0.184991 -0.194347 -0.025697 -0.016566 -0.005432
polarizability: 1.47798216e+02 -3.39085030e+00 1.37984768e+02 7.76373090e+00 -2.27720180e+00 7.64260206e+01
1716.lowfreq: -9.4152 -3.5306 -0.0006 -0.0004 0.0004 14.6433 65.1980 82.9217 95.3234
frequency: 65.1920 82.9132 95.3070 118.8728 143.1523 166.7431 197.1335 218.7533 268.0054 286.6540 311.4775 337.0892 367.3090 406.6605 465.0354 504.7153 541.5551 549.3518 609.5663 663.6601 715.1209 772.2295 782.2514 795.3363 807.5666 837.2418 857.1264 909.2889 948.0609 965.4218 971.7813 1010.3921 1030.4103 1059.5947 1065.4085 1087.5205 1106.1296 1175.7991 1201.5639 1235.1659 1248.0504 1252.6066 1260.1020 1276.3258 1313.4669 1319.5345 1366.9972 1384.6570 1394.0468 1424.0857 1443.4555 1466.4303 1471.3774 1472.2594 1482.2483 1484.4511 1498.1831 1499.0840 1597.0802 1603.4614 2973.0653 2977.5208 2978.2397 2985.8784 3034.4764 3037.7606 3072.8120 3073.0837 3083.2983 3089.3158 3114.3659 3121.6989 3153.3924 3431.7475 3532.6061
redmass: 3.3544 2.7346 4.5220 2.7251 3.4239 4.6307 1.0795 1.1108 3.7892 3.0231 1.5407 2.0267 1.7978 3.7512 3.2083 3.3225 4.2475 3.8291 4.3109 3.4451 3.6211 1.6422 1.3499 1.2425 2.2494 2.9628 3.1236 1.3656 1.7747 2.3498 1.3487 1.9648 1.7796 1.9831 2.0035 1.6832 1.5557 1.1669 2.6206 1.4021 1.3066 1.6880 1.5800 1.4050 1.4453 1.7032 2.5827 1.2122 1.2158 1.5066 2.9465 1.7552 1.0483 1.1551 1.0610 1.0756 1.0818 1.1229 5.9356 6.2397 1.0635 1.0358 1.0370 1.0597 1.0963 1.1004 1.0998 1.0996 1.1004 1.1010 1.0859 1.0917 1.0988 1.0751 1.0683
irintensity: 0.4746 0.7748 1.5615 0.3416 0.2894 3.5656 0.2837 1.1906 1.1848 0.0319 65.7495 25.7581 60.0680 5.1212 5.6660 3.4371 5.8662 3.5624 4.6486 13.7768 99.5365 55.8219 3.8639 4.5767 18.6261 7.8594 25.4557 0.3853 41.1316 2.8142 0.6633 8.7134 2.8893 14.0222 5.0505 10.3707 4.3183 2.5416 4.8896 0.3694 15.1841 15.3167 43.8654 13.9952 2.0708 0.5872 0.1941 13.4253 8.2344 8.5119 21.4717 9.5524 4.0006 17.3126 2.4580 5.5978 7.6438 20.9274 2.1052 4.2598 31.9402 55.4333 24.4230 34.9346 7.1850 8.5099 55.0916 53.9460 34.0708 24.9822 0.5459 28.8222 30.0898 0.9674 17.2320
temp: 298.150 k
press: 1.00000 atm
elementType: 8 7 6 6 6 6 6 6 6 6 6 6 1 1 1 1 1 1 1 1 1 1 1 1 1 1 1
symmnumber: 1
zpe: 602019.0 jmol-1
zpe.correction: 0.229297 hartree
zpe.thermalcorrener: 0.242103 hartree
zpe.thermalcorrenthalpy: 0.243047 hartree
zpe.thermalcorrgfe: 0.190720 hartree
zpe.sumelectzpe: -519.066011 hartree
zpe.sumelectthermal: -519.053205 hartree
zpe.sumelectthermalent: -519.052261 hartree
zpe.sumelectthermalfe: -519.104587 hartree
dipole: -0.4829 -0.1601 0.6658
dipole: 0.8379
quadrupole: -63.5740 -67.4844 -78.7236
quadrupole: -0.2838 3.1941 -2.3136
quadrupole: 6.3533 2.4429 -8.7962 -0.2838 3.1941 -2.3136
hfenergy: -519.2953078 hartree
pointgroup: C01 [X(C10H15N1O1)]
dipole: -0.1850789 -0.0579566 0.2665905 debye
polarizability: 148.1685904|-2.7608296|137.4805591|7.2340703|-4.6264942|76.559855 unknown
InChI: InChI=1S/C10H15NO/c1-3-8-6-5-7-9(4-2)10(8)11-12/h5-7,11-12H,3-4H2,1-2H3
charge 0 multiplicity 1
27 atoms
O  0.916156 -2.485483 -0.60718
N  0.034539 -1.773627 0.400855
C  1.060406 0.471253 0.322942
C  -1.332757 0.184193 -0.296887
C  -0.076076 -0.368139 0.110782
C  2.404103 -0.086043 0.768262
C  -2.570147 -0.683888 -0.49729
C  0.920312 1.862968 0.110688
C  -1.429934 1.584547 -0.478896
C  -0.312623 2.424338 -0.28616
C  3.395076 -0.300841 -0.408908
C  -3.300252 -1.026012 0.831649
H  2.861592 0.619466 1.488814
H  2.247998 -1.037049 1.310977
H  -3.276763 -0.146561 -1.15618
H  -2.313291 -1.621351 -1.032012
H  1.787859 2.513464 0.278119
H  -2.390569 2.014086 -0.788728
H  -0.402652 3.50515 -0.440618
H  2.969493 -0.996054 -1.153382
H  4.356477 -0.709709 -0.045079
H  3.604881 0.655263 -0.921954
H  -2.649904 -1.586426 1.529213
H  -4.202431 -1.635683 0.640611
H  -3.612287 -0.101551 1.349538
H  -0.868632 -2.258925 0.29526
H  1.647321 -2.841287 -0.035837
