program: Gaussian 09
title: 000184020
version: EM64L-G09RevD.01
frameworkgroup: C1[X(C15H26O4)]
method: RPBEPBE
basis: SDD
operation: Freq
keyword: #pfreq=noraman
keyword: PBEPBE/SDD
title: #p freq=noraman PBEPBE/SDD
converged: YES YES NO NO
title: Mulliken charges:
elementType: O O O O C C C C C C C C C C C C C C C H H H H H H H H H H H H H H H H H H H H H H H H H H
charge: -0.380207 -0.185967 -0.171026 -0.454458 -0.139475 -0.094645 0.201733 -0.490914 0.343325 -0.535497 -0.528832 -0.098644 -0.781130 -0.051155 -0.729516 -0.106836 -0.722323 -0.717683 -0.563747 0.272694 0.253370 0.230205 0.241585 0.240532 0.238946 0.247520 0.235919 0.233133 0.205405 0.216383 0.275240 0.288065 0.248776 0.208107 0.222977 0.214265 0.382588 0.223962 0.219647 0.199931 0.252146 0.210217 0.190262 0.213845 0.241275
chargesum: 0.00000
title: Mulliken charges with hydrogens summed into heavy atoms:
elementType: O O O O C C C C C C C C C C C C C C C
charge: -0.380207 -0.185967 -0.171026 -0.071870 0.133219 0.158726 0.201733 -0.019124 0.343325 -0.056019 -0.045393 0.134490 -0.084103 0.236910 -0.049656 0.107429 -0.078782 -0.065057 -0.108627
polarizability: 2.13784156e+02 2.03486548e+00 1.58859088e+02 4.76565620e+00 7.18695245e+00 1.48973850e+02
1716.lowfreq: -9.8677 -0.0005 -0.0002 0.0004 2.0135 8.0352 19.2557 28.8734 38.7488
frequency: 15.3504 28.6826 38.6714 45.6596 58.6512 76.6557 95.7920 118.9891 158.9876 186.3152 192.8761 214.4605 218.4478 233.7872 243.3637 252.0761 263.5361 281.5506 325.3029 328.5948 335.8832 340.2381 351.8343 379.9064 389.2311 421.4107 440.2976 451.6353 459.6711 508.5994 511.5944 567.4890 610.9920 668.2078 688.7447 695.1272 720.8888 734.8044 756.0468 771.9805 789.1433 818.3618 844.2512 854.2844 858.9531 876.5916 907.2910 919.3847 920.9333 931.3899 950.7004 953.0875 960.6537 964.2016 981.2092 994.9248 996.6344 1016.9913 1027.6644 1036.2533 1049.1519 1058.5600 1099.5613 1121.9008 1125.6209 1151.6267 1157.8535 1163.3355 1177.6078 1185.3034 1206.5846 1211.7605 1223.8933 1227.4566 1262.2809 1270.8241 1278.3861 1294.6861 1299.7712 1301.3794 1313.2876 1318.5654 1324.4706 1353.7995 1354.8156 1373.4682 1382.9724 1388.7496 1391.9405 1428.6024 1440.3801 1454.0971 1458.0427 1465.3089 1466.8150 1470.6433 1471.6589 1475.2469 1477.2250 1480.4885 1490.6447 1499.3203 1659.0948 2967.0470 2970.1702 2981.1743 2987.5402 2987.9092 2988.8214 3013.9782 3017.2064 3025.4276 3030.3594 3048.6346 3057.2683 3068.6219 3073.9264 3078.6303 3078.6578 3081.7433 3086.1850 3091.6179 3093.0839 3098.6958 3102.2029 3106.8554 3118.5931 3166.4594 3208.4984
redmass: 4.1858 3.6877 3.3483 3.3055 4.3758 2.6144 4.1697 2.7754 3.8681 1.1461 3.1584 1.0391 1.1153 3.1958 2.0476 3.8398 1.8157 1.5587 2.5107 2.3150 2.8804 2.4714 2.8729 2.6932 3.4546 2.4338 3.5392 4.3829 3.4916 3.3064 3.5140 2.6567 3.6055 1.8774 2.6418 4.4618 1.5391 4.4482 3.4196 3.6204 4.2962 2.3873 2.4209 2.7660 3.1844 2.3941 2.3933 1.7820 1.1907 2.1133 1.5618 1.8852 1.4775 2.0608 2.2010 1.6336 1.1096 1.6306 1.7848 1.8568 1.9564 1.6091 2.2602 2.0189 2.3374 2.3393 1.9411 2.0163 2.0592 2.0981 2.3007 1.7973 1.4682 1.8704 1.3149 1.3161 1.3779 1.2934 1.4061 1.3849 1.3596 1.3963 1.3196 1.3662 1.4410 1.2084 1.2108 1.2034 1.2152 1.1948 1.1746 1.1867 1.0645 1.0552 1.0652 1.0782 1.0482 1.0629 1.0663 1.0531 1.0513 1.0517 4.8894 1.0378 1.0387 1.0378 1.0831 1.0366 1.0816 1.0734 1.0610 1.0846 1.0797 1.0617 1.0971 1.0961 1.0981 1.0982 1.0844 1.1010 1.0953 1.1001 1.0989 1.0998 1.1000 1.0732 1.1036 1.0698 1.1139
irintensity: 0.6818 0.9541 0.2035 1.8111 0.1944 0.0850 2.4668 0.1586 0.5693 0.1992 0.8471 0.1099 0.1745 1.5098 0.8824 4.8274 0.1985 1.2361 1.3279 1.4561 4.5557 1.0901 2.0865 2.5500 0.8064 0.0508 6.0075 17.9427 1.8645 2.9745 2.4470 0.7820 3.9970 7.3526 29.2934 4.5223 47.2126 37.7061 3.3959 18.1188 11.8990 17.0012 33.2218 16.0569 15.8228 20.5687 22.1423 5.0003 3.1348 16.5882 6.9865 8.7214 34.7088 18.5506 74.0208 25.3026 13.5502 1.2821 26.1425 45.7308 22.2375 6.5056 8.9311 42.3720 1.3061 33.5633 3.2199 11.9375 26.3048 5.1160 17.4588 20.6382 14.2322 14.0654 0.5042 8.1777 1.9518 1.6512 3.4187 18.9782 6.7942 0.1774 11.1878 9.4148 1.7453 20.2442 17.4288 17.9742 27.7661 14.6070 71.6447 54.9054 4.4060 6.2688 5.9848 17.6090 6.6685 4.8910 16.5839 7.9439 25.0313 20.6434 6.6087 27.8297 51.0824 20.5233 23.8562 20.9489 4.2567 11.7738 21.5147 2.9952 35.0460 16.7512 4.9324 70.5496 38.5273 46.8091 1.4133 16.8104 51.2893 17.5125 23.5737 28.4771 18.4464 14.2736 12.1538 676.0882 10.6369
temp: 298.150 k
press: 1.00000 atm
elementType: 8 8 8 8 6 6 6 6 6 6 6 6 6 6 6 6 6 6 6 1 1 1 1 1 1 1 1 1 1 1 1 1 1 1 1 1 1 1 1 1 1 1 1 1 1
symmnumber: 1
zpe: 1011572.6 jmol-1
zpe.correction: 0.385288 hartree
zpe.thermalcorrener: 0.406538 hartree
zpe.thermalcorrenthalpy: 0.407482 hartree
zpe.thermalcorrgfe: 0.334319 hartree
zpe.sumelectzpe: -886.459921 hartree
zpe.sumelectthermal: -886.438671 hartree
zpe.sumelectthermalent: -886.437727 hartree
zpe.sumelectthermalfe: -886.510890 hartree
dipole: 4.5487 2.3212 2.8515
dipole: 5.8489
quadrupole: -103.4192 -115.0931 -120.5398
quadrupole: 1.4555 -7.9567 5.0485
quadrupole: 9.5982 -2.0758 -7.5224 1.4555 -7.9567 5.0485
hfenergy: -886.8452089 hartree
pointgroup: C01 [X(C15H26O4)]
dipole: -1.6510625 1.3704869 -0.8312605 debye
polarizability: 210.5735104|-4.8624656|162.7663381|14.527855|-0.4806766|148.2772452 unknown
InChI: InChI=1S/C15H26O4/c1-6-14(5)8-7-12(17-14)11(4)15(16)9-13(10(2)3)18-19-15/h6,10-13,16H,1,7-9H2,2-5H3
charge 0 multiplicity 1
45 atoms
O  -1.648922 -0.081067 -1.076724
O  1.342852 -0.353413 1.829917
O  2.763607 0.185544 2.138297
O  0.786983 -0.760282 -0.453414
C  -0.494572 0.922345 0.885223
C  -1.320335 1.223593 -0.398173
C  0.89538 0.28294 0.541915
C  -2.70069 1.880485 -0.183059
C  -3.104083 -0.425114 -0.906785
C  2.061021 1.226443 0.146552
C  -3.643584 0.678461 0.058961
C  3.297354 0.567276 0.7983
C  -0.339753 2.154177 1.805118
C  3.925714 -0.634274 0.053201
C  -3.750041 -0.347798 -2.309472
C  -3.267686 -1.819544 -0.322936
C  4.51309 -0.189548 -1.307872
C  5.014085 -1.287497 0.935381
C  -2.298743 -2.631892 0.162477
H  -1.037222 0.136212 1.448933
H  -0.702766 1.791738 -1.118724
H  -2.997161 2.423804 -1.098475
H  -2.706388 2.598756 0.65142
H  1.92203 2.231279 0.576247
H  2.129255 1.298454 -0.948663
H  -3.573517 0.330588 1.104551
H  -4.698902 0.919086 -0.153253
H  4.078685 1.315214 1.047476
H  -0.055566 3.063875 1.243071
H  -1.280942 2.370012 2.33994
H  0.434918 1.953108 2.564958
H  3.118566 -1.366871 -0.131549
H  -3.207892 -1.007766 -3.007255
H  -4.807061 -0.669719 -2.27455
H  -3.709264 0.682928 -2.703884
H  -4.314138 -2.162448 -0.308762
H  -0.16985 -0.820446 -0.774127
H  3.731816 0.175766 -1.998016
H  5.01503 -1.042301 -1.800302
H  5.26774 0.612031 -1.179316
H  4.600857 -1.57208 1.918056
H  5.416254 -2.19497 0.448792
H  5.859865 -0.591124 1.104526
H  -2.550961 -3.618196 0.567683
H  -1.239565 -2.355065 0.171016
