program: Gaussian 09
title: 000015628
version: EM64L-G09RevD.01
frameworkgroup: C1[X(C4H9NO2)]
method: RPBEPBE
basis: SDD
operation: Freq
keyword: #pfreq=noraman
keyword: PBEPBE/SDD
title: #p freq=noraman PBEPBE/SDD
converged: YES YES NO NO
title: Mulliken charges:
elementType: O O N C C C C H H H H H H H H H
charge: -0.309472 -0.292302 -0.620368 0.041716 -0.683805 -0.677689 0.298082 0.235701 0.207127 0.231447 0.220447 0.209479 0.252873 0.215767 0.333328 0.337668
chargesum: 0.00000
title: Mulliken charges with hydrogens summed into heavy atoms:
elementType: O O N C C C C
charge: -0.309472 -0.292302 0.050628 0.277417 -0.024784 0.000430 0.298082
polarizability: 7.14604805e+01 -1.48217749e+00 5.49419398e+01 1.70807709e+00 -4.88466965e+00 4.62560242e+01
1716.lowfreq: -3.5024 -0.0012 -0.0001 0.0003 7.5878 9.6942 58.3070 97.7260 181.9823
frequency: 57.9931 97.7110 181.9797 194.0317 242.9356 305.9433 380.9824 424.8607 465.9273 484.3803 518.1840 608.6051 705.0417 755.9361 881.5505 925.7891 940.4722 970.9575 1053.8177 1106.9680 1158.6811 1182.0482 1289.2534 1336.5706 1350.5298 1376.6611 1394.5559 1457.1374 1464.5814 1473.5163 1487.0121 1585.0555 1678.2477 2986.6728 2991.7918 3025.2195 3081.9488 3092.4489 3096.9182 3102.4109 3558.5801 3717.8820
redmass: 4.0649 4.0870 2.4931 1.0775 1.2048 2.4812 3.5910 2.6690 2.4193 1.1823 1.0531 5.1813 11.2636 3.2408 2.6478 1.2388 1.3463 5.4741 1.9649 1.7788 2.0429 1.9547 1.7915 1.5614 1.8252 1.2627 1.2390 1.0539 1.0476 1.0502 1.0481 1.2266 6.9635 1.0354 1.0357 1.0865 1.0992 1.0988 1.1006 1.1006 1.0444 1.1058
irintensity: 4.3982 6.6391 9.7696 1.2306 1.9552 1.7781 8.1205 6.1442 1.4363 311.6818 18.3971 1.1032 31.8417 4.8593 6.4465 2.8698 0.9333 145.5028 9.6291 101.2593 13.7355 35.3674 283.1384 31.2755 107.5110 35.7979 15.1552 6.1797 5.2798 5.7432 22.1888 94.2357 363.8345 17.4605 21.4394 6.2908 7.9071 53.4226 21.6759 34.0536 56.9958 46.4932
temp: 298.150 k
press: 1.00000 atm
elementType: 8 8 7 6 6 6 6 1 1 1 1 1 1 1 1 1
symmnumber: 1
zpe: 348064.2 jmol-1
zpe.correction: 0.132571 hartree
zpe.thermalcorrener: 0.141060 hartree
zpe.thermalcorrenthalpy: 0.142004 hartree
zpe.thermalcorrgfe: 0.099654 hartree
zpe.sumelectzpe: -362.471289 hartree
zpe.sumelectthermal: -362.462800 hartree
zpe.sumelectthermalent: -362.461855 hartree
zpe.sumelectthermalfe: -362.504206 hartree
dipole: -0.1677 -1.9681 1.4082
dipole: 2.4258
quadrupole: -32.9378 -44.3090 -43.6766
quadrupole: -5.8454 4.5275 0.8589
quadrupole: 7.3700 -4.0012 -3.3688 -5.8454 4.5275 0.8589
hfenergy: -362.6038593 hartree
pointgroup: C01 [X(C4H9N1O2)]
dipole: -0.1351867 0.7740619 -0.5416606 debye
dipolederiv: -1.7395882 -0.0856681 -0.0899124 0.1284757 -0.5129191 0.0496873 -0.1221202 0.0502996 -0.3795058 -0.7285685 0.048243 -0.06915 0.0983553 -0.8542272 0.3244952 -0.0974517 0.3167761 -0.5754125 -0.9495062 -0.4379475 0.2422106 -0.4392543 -0.7401071 -0.0307635 0.2693106 -0.0135796 -0.7223969 0.9238276 0.121966 -0.010239 0.2913257 0.4205402 0.09383 -0.1653958 0.0961357 0.3287766 -0.0970031 0.0567804 0.0109173 0.0714802 -0.0439499 -0.0522103 0.0351682 -0.0414878 0.0683813 -0.0732588 0.0164898 0.0015242 -0.0553587 -0.1135373 -0.1101215 0.0187562 -0.1453948 -0.023215 2.1704515 0.3104028 -0.0369765 -0.0125005 1.2301355 -0.5996949 0.0954362 -0.5780932 0.7090305 0.0085084 0.0147869 -0.0595077 -0.0531505 0.0121475 0.0402709 0.0137702 0.0307316 -0.0925602 -0.105324 -0.0732104 0.0576405 -0.1075755 0.0279793 0.051299 0.061513 0.0378199 0.084045 0.0934811 -0.0314237 -0.0408958 0.0048152 -0.0575509 -0.1261376 -0.0291172 -0.125951 -0.0077133 0.0846276 0.02051 -0.0098462 0.0466011 0.0564254 0.0557215 -0.0652239 0.1026047 -0.1078931 -0.0885322 -0.1297376 0.0474094 -0.1319793 0.0351693 0.0165133 0.0494031 0.0330255 0.0647203 -0.0138261 0.1331387 0.0248246 0.1082644 0.0151864 -0.0283229 0.0101244 -0.0093346 0.0840354 0.1011585 0.0035157 -0.0391874 0.0285327 0.0359438 0.1075424 -0.046839 0.039567 -0.1090536 0.201212 0.0077054 -0.0082707 0.0322145 0.2495504 0.1032083 -0.0250372 0.0994861 0.3418306 0.2123404 0.0244486 -0.0205409 -0.0102461 0.2392138 0.1046828 -0.0022969 0.1073949 0.3369308 unknown
polarizability: 70.9998683|3.3280254|55.6423806|-0.5323065|-4.7708103|46.0161955 unknown
InChI: InChI=1S/C4H9NO2/c1-3(2)7-4(5)6/h3H,5H2,1-2H3
charge 0 multiplicity 1
16 atoms
O  0.010716 0.606244 -0.313207
O  1.468564 -0.949056 0.710763
N  2.254831 0.926522 -0.461334
C  -1.172765 -0.210359 0.127612
C  -2.333071 0.783747 0.222223
C  -1.403635 -1.34595 -0.879303
C  1.272774 0.096078 0.039104
H  -0.922694 -0.63212 1.119088
H  -3.245011 0.265403 0.56999
H  -2.098075 1.594305 0.933097
H  -2.543237 1.23386 -0.764261
H  -2.288822 -1.939671 -0.584893
H  -0.531553 -2.020708 -0.908419
H  -1.579272 -0.937399 -1.890544
H  2.006252 1.756924 -0.992963
H  3.2270 0.694181 -0.280954
