program: Gaussian 09
title: 000183988
version: EM64L-G09RevD.01
frameworkgroup: C1[X(C9H11NO3)]
method: RPBEPBE
basis: SDD
operation: Freq
keyword: #p
keyword: freq=noraman
keyword: PBEPBE/SDD
title: #p freq=noraman PBEPBE/SDD
converged: YES YES NO NO
title: Mulliken charges:
elementType: O O O N C C C C C C C C C H H H H H H H H H H H
charge: -0.337634 -0.439510 -0.280930 -0.367854 -0.345408 0.416483 -0.504644 -0.439712 -0.644833 0.333631 -0.155996 -0.375356 0.284202 0.220563 0.253943 0.325395 0.301802 0.252167 0.235143 0.207341 0.220688 0.229779 0.252649 0.358092
chargesum: 0.00000
title: Mulliken charges with hydrogens summed into heavy atoms:
elementType: O O O N C C C C C C C C C
charge: -0.337634 -0.081418 -0.280930 -0.042459 0.129098 0.416483 -0.202842 -0.187545 0.018339 0.333631 0.073782 -0.122708 0.284202
polarizability: 1.72261046e+02 -1.09719326e+00 1.21169289e+02 -4.69357987e+00 -4.02914312e-01 5.87341053e+01
1716.lowfreq: -7.9431 -1.1770 -0.0003 0.0001 0.0007 7.2354 17.1199 36.7379 45.8011
frequency: 16.9914 36.7242 45.7726 97.5483 118.5635 205.9428 220.0035 236.0728 262.0401 300.1348 334.6276 374.0829 408.8571 432.2816 447.4493 515.4540 583.8585 591.9129 596.4241 671.0832 680.1748 685.6688 729.8640 783.4049 789.9408 871.8654 878.3378 883.0070 900.2554 964.9481 974.4859 983.2277 1071.8830 1076.3397 1108.6879 1128.4848 1146.8713 1151.2148 1166.8444 1195.8051 1270.1759 1287.3511 1308.2194 1358.5642 1390.1225 1397.4591 1439.5420 1467.9543 1471.4098 1481.4165 1482.9421 1495.0999 1602.0126 1621.0060 1682.3952 2984.4757 2998.1225 3069.3895 3087.3779 3099.5029 3144.2247 3170.0528 3173.2007 3183.4056 3566.7710 3580.0113
redmass: 2.9097 4.9949 5.2729 4.5710 3.2939 1.6706 4.8753 4.8717 2.1359 4.8893 4.7887 1.1298 3.0311 3.5793 2.9314 7.5983 1.4747 5.6501 2.6908 5.7347 3.2169 4.2159 4.7607 1.4363 1.4513 1.4809 1.4217 2.5647 3.2248 1.3159 3.5779 5.3794 1.6155 2.5748 2.0482 2.3159 1.7659 1.3089 1.1865 2.2464 3.0333 1.2067 1.3685 1.2885 1.2189 8.5493 3.0195 1.1109 1.0613 1.5466 1.2277 2.0846 6.5439 6.7044 9.6367 1.0358 1.0663 1.0983 1.0976 1.1019 1.0877 1.0926 1.0927 1.0986 1.0772 1.0660
irintensity: 0.7485 2.4370 4.0486 0.5454 1.6646 4.3908 0.6797 1.2498 2.1822 1.1940 19.5774 143.2479 4.6899 11.4835 13.4095 2.4833 95.4598 2.5437 28.7433 5.3939 1.2963 57.6089 2.0777 48.0750 13.1568 48.6055 11.0763 13.8786 15.5854 1.7412 172.1835 7.7874 31.7064 32.7092 11.5255 500.9176 15.1688 109.5325 73.0440 289.2922 147.2087 27.7682 3.1009 3.0935 19.9192 8.8302 56.8407 125.1166 9.1563 218.4373 137.2179 58.0365 154.4033 31.7922 272.0476 27.5115 49.5058 9.1437 35.1102 35.5685 12.0414 12.2313 7.2700 7.7971 39.3954 34.2671
temp: 298.150 k
press: 1.00000 atm
elementType: 8 8 8 7 6 6 6 6 6 6 6 6 6 1 1 1 1 1 1 1 1 1 1 1
symmnumber: 1
zpe: 493336.0 jmol-1
zpe.correction: 0.187902 hartree
zpe.thermalcorrener: 0.200794 hartree
zpe.thermalcorrenthalpy: 0.201739 hartree
zpe.thermalcorrgfe: 0.146452 hartree
zpe.sumelectzpe: -629.020684 hartree
zpe.sumelectthermal: -629.007791 hartree
zpe.sumelectthermalent: -629.006847 hartree
zpe.sumelectthermalfe: -629.062134 hartree
dipole: 3.5233 -1.6435 -0.1487
dipole: 3.8906
quadrupole: -66.2040 -69.6227 -79.8154
quadrupole: -1.1868 -0.9448 0.2027
quadrupole: 5.6767 2.2580 -7.9347 -1.1868 -0.9448 0.2027
hfenergy: -629.2085854 hartree
pointgroup: C01 [X(C9H11N1O3)]
dipole: 1.4184763 -0.5710344 0.0698837 debye
dipolederiv: -2.3940135 -0.3975147 0.0153975 -0.8734371 -0.6124882 0.0231625 0.1127852 0.0376099 -0.2060683 -0.4343938 0.5189281 -0.0531512 0.6438631 -1.1100163 0.0574269 -0.0612158 0.0542016 -0.4356016 -0.8640745 0.059977 -0.0158802 0.018618 -0.9664599 0.0626136 0.006968 0.0412222 -0.3446543 -1.6956552 0.0726521 -0.0963058 0.2221309 -0.3550593 -0.0238855 -0.0374296 -0.0494209 -0.5364062 0.7243918 0.1050506 0.0348766 0.4261164 0.1599176 0.0593471 -0.0269075 0.064772 0.3212025 1.7411128 0.1351802 -0.0119707 0.0042625 0.314974 -0.0227005 -0.0357307 -0.0218976 0.1398058 -0.5589883 0.2636862 -0.0274524 0.1517184 -0.2729937 0.0045705 -0.0079467 0.0023004 -0.2269868 -0.5136669 -0.0610804 0.0016335 -0.2264797 -0.1403042 -0.0063899 0.0249469 -0.0085275 -0.2394349 -0.0827836 -0.0267835 -0.0541609 -0.0849963 0.0955191 -0.0014922 -0.057702 -0.0249764 -0.0702896 0.476427 -0.4396507 0.038009 -0.6046707 1.1545919 -0.0949523 0.0513195 -0.0909667 0.1059112 0.3118027 -0.0182073 -0.0039578 -0.0974091 0.1896792 -0.029656 0.0008678 -0.0295113 -0.1249819 -0.0567466 -0.1053112 0.0042472 0.2357308 -0.3849851 0.0146172 -0.024774 0.0186899 -0.2095182 2.8475995 0.0231383 0.0271355 0.4665068 1.4346236 -0.1069205 -0.0947223 -0.0766981 0.3126422 -0.1335638 0.0010135 0.0794291 -0.0025735 0.0675538 -0.1001895 0.1046688 -0.0594108 -0.0933208 0.0949684 0.0714614 -0.045885 -0.0251064 -0.0283182 0.047568 -0.0324707 0.025609 0.0754909 0.1713755 -0.0056036 0.002719 -0.0827659 0.149346 0.0230628 0.0298395 0.0450846 0.3587023 0.2280983 -0.0191638 0.0052663 -0.010591 0.0136007 0.0176581 0.0026801 0.0168003 0.1985812 0.0575051 0.0837767 -0.0046733 0.079097 -0.0116216 0.0180732 -0.0042857 0.0175187 0.1859798 0.0383367 0.0595427 0.1096685 0.0556107 0.0674267 -0.0606976 0.063759 -0.0512347 -0.0599205 0.0900401 0.0428218 -0.0292209 0.0914656 -0.1452204 0.0716046 -0.030715 0.0231222 0.0521566 -0.1502185 -0.1151136 -0.010506 -0.1472774 0.0261681 0.0102384 -0.0178382 0.0268245 0.0806794 0.0190026 -0.0936271 0.0103602 -0.1011388 -0.0598809 0.0214766 0.0119348 0.0218746 0.152025 -0.0724358 0.0098795 0.0032202 0.0145898 0.1022511 0.0072086 0.0029885 0.0072104 0.1814134 0.1558797 -0.1650524 0.0212016 -0.1532643 0.311696 0.0082558 0.0189798 0.0098037 0.3825926 unknown
polarizability: 172.3978597|1.7058242|120.6997044|1.8085204|-5.5521918|59.066876 unknown
InChI: InChI=1S/C9H11NO3/c1-2-10-9(12)13-8-5-3-4-7(11)6-8/h3-6,10-11H,2H2,1H3
charge 0 multiplicity 1
24 atoms
O  0.653538 -0.751498 -0.05054
O  -3.543149 1.904901 -0.220771
O  1.346458 1.532814 -0.221747
N  2.850324 -0.270261 -0.147158
C  4.086699 0.526306 -0.196179
C  -0.757563 -0.565288 -0.038482
C  -1.407329 0.685155 -0.145504
C  -1.485234 -1.769934 0.088858
C  4.87815 0.483373 1.127763
C  -2.823128 0.701748 -0.120641
C  -2.895594 -1.714439 0.109211
C  -3.579147 -0.484703 0.00552
C  1.603915 0.305748 -0.147132
H  4.716501 0.162625 -1.030879
H  3.786377 1.561395 -0.430423
H  2.89736 -1.286596 -0.062391
H  -0.820975 1.602827 -0.241013
H  -0.944875 -2.716813 0.168252
H  4.271712 0.885264 1.957749
H  5.18012 -0.548445 1.386332
H  5.796029 1.092936 1.040889
H  -3.468468 -2.642597 0.207133
H  -4.670663 -0.426031 0.020026
H  -2.928059 2.675414 -0.305972
