program: Gaussian 09
title: 000184044
version: EM64L-G09RevD.01
frameworkgroup: C1[X(C20H24O6)]
method: RPBEPBE
basis: SDD
operation: Freq
keyword: #pfreq=noraman
keyword: PBEPBE/SDD
title: #p freq=noraman PBEPBE/SDD
converged: YES YES NO NO
title: Mulliken charges:
elementType: O O O O O O C C C C C C C C C C C C C C C C C C C C H H H H H H H H H H H H H H H H H H H H H H H H
charge: -0.284850 -0.445079 -0.498903 -0.251310 -0.400871 -0.345186 -0.100424 -0.625843 0.275212 0.308898 -0.009823 0.233601 0.297086 0.016395 -0.004362 -0.111782 -0.750119 -0.739468 -0.223189 -0.340832 -0.692617 -0.715790 0.218498 0.376710 -0.455387 -0.787491 0.244967 0.238715 0.263916 0.251283 0.207669 0.217538 0.199676 0.263666 0.216146 0.232212 0.280926 0.218993 0.217710 0.248082 0.241934 0.225546 0.207200 0.347771 0.343539 0.264374 0.382684 0.249990 0.241947 0.250444
chargesum: 0.00000
title: Mulliken charges with hydrogens summed into heavy atoms:
elementType: O O O O O O C C C C C C C C C C C C C C C C C C C C
charge: -0.284850 -0.097308 -0.155365 -0.251310 -0.018187 -0.345186 0.144543 -0.123212 0.275212 0.308898 -0.009823 0.233601 0.297086 0.016395 -0.004362 -0.111782 -0.073630 -0.059979 0.009023 -0.059906 -0.007832 -0.041111 0.218498 0.376710 -0.191013 -0.045110
polarizability: 3.11794470e+02 -3.67784299e+01 3.12125811e+02 1.35459622e+01 7.64982434e+00 1.45737644e+02
1716.lowfreq: -6.7360 -5.6934 -0.0010 -0.0007 -0.0002 4.4712 26.5874 29.8127 34.3344
frequency: 26.5066 29.7933 34.2710 46.3312 59.1591 83.6157 102.2145 111.5398 125.5754 138.2520 152.9202 179.2136 196.2394 196.6939 209.1342 220.3103 225.0699 235.1687 243.4553 254.6364 259.6769 264.2710 280.0507 286.8444 312.6248 330.5272 337.6012 346.0729 363.1041 371.3652 373.7054 382.2496 398.8166 412.8326 447.5102 471.1457 489.7982 503.0409 519.2431 526.7528 535.9957 558.1361 563.8817 572.7760 610.4065 617.0033 620.7580 650.7958 666.5867 688.4629 713.7708 742.0783 763.5107 802.3768 813.1778 834.5234 848.4669 852.9707 875.0439 903.2435 914.7827 917.9547 923.9376 934.6155 943.0663 970.6518 976.0786 981.1666 985.3989 995.1166 1018.4000 1020.1558 1050.3375 1058.1357 1079.3799 1087.1155 1101.6247 1118.5800 1154.3386 1162.6839 1168.9035 1175.6685 1203.0769 1216.6100 1221.3207 1241.3588 1260.6492 1285.0350 1297.0063 1305.7991 1322.8213 1336.6668 1342.7507 1372.6726 1376.9585 1377.4299 1380.4933 1392.3876 1394.8040 1400.8563 1403.9951 1413.4894 1432.8564 1449.5565 1451.5702 1452.2508 1453.2909 1457.5009 1457.9201 1461.8411 1463.4353 1469.1981 1478.4624 1481.3969 1487.8092 1549.5059 1585.8298 1612.2820 1643.1893 1668.8404 2608.7724 2973.1114 2980.0597 2982.3772 2993.3884 2994.1569 3017.2649 3048.9608 3061.0673 3068.6450 3073.5546 3081.1781 3084.8028 3093.1625 3094.2035 3099.1847 3102.8235 3105.0711 3120.2417 3133.7533 3169.5658 3189.2950 3505.8532 3577.9306
redmass: 4.2769 3.7521 4.0633 4.8432 3.7081 4.5122 3.2155 3.0671 1.5166 4.1066 5.1166 3.1592 1.0955 3.4795 2.7639 1.1027 4.2704 1.1989 1.6659 1.7539 3.5958 1.6448 1.8423 2.9636 4.2573 2.9265 4.3636 2.5456 3.8420 4.0245 2.6952 4.5457 4.6406 3.4473 2.6519 1.6614 4.9010 4.9301 2.7928 4.8530 4.0727 5.0051 5.2113 3.5307 4.5281 6.5966 6.0961 5.6966 4.8504 5.1010 3.4217 2.6108 3.9225 4.2225 4.2889 3.2533 3.8147 1.5481 4.1413 2.2240 2.3399 1.6193 1.5763 2.9447 1.9221 2.9551 1.2230 1.1172 1.4782 1.3131 2.4397 1.8082 1.5281 3.2725 3.1417 1.4917 3.9519 2.0032 1.9253 3.0693 1.3880 1.7858 2.3358 3.3293 2.5388 2.2485 1.4805 2.4667 2.0263 2.4601 1.6722 1.5659 2.4216 1.2674 1.2220 1.8755 1.3846 1.3712 1.2275 1.6082 3.6957 3.1614 4.4011 2.0972 1.1012 1.0464 1.1964 1.0734 1.0618 1.0815 1.1550 1.1233 1.0560 1.0593 1.0660 5.0135 7.3712 5.5240 6.5759 4.9138 1.0755 1.0381 1.0371 1.0348 1.0377 1.0354 1.0590 1.0873 1.0976 1.0981 1.0974 1.0998 1.1014 1.1006 1.0995 1.0985 1.0986 1.1007 1.0991 1.0874 1.0981 1.0933 1.0643 1.0663
irintensity: 0.0898 0.6169 0.6170 0.3799 3.6800 2.6017 0.6255 0.1956 0.0146 1.7821 0.2326 2.7874 0.1568 1.3017 5.2538 7.0575 0.6070 2.0788 8.1894 33.4331 1.2241 52.1381 12.3648 14.1333 10.6977 7.6595 21.0187 5.9039 0.8117 6.1828 0.5841 2.5529 0.7239 1.8399 5.2350 120.4849 5.8153 31.3609 72.0714 28.8882 3.1751 9.7708 1.6461 22.9618 11.8503 4.2905 3.9605 2.8335 8.0648 6.3623 17.5104 12.5286 43.5740 10.1342 3.0050 15.4217 8.4917 29.9374 23.9381 10.2288 15.6172 3.6084 1.9784 10.6159 7.4164 3.1722 23.6664 104.0910 3.1884 0.4857 76.8450 20.3239 11.4968 32.6655 159.8081 124.3134 23.6724 156.9171 5.4067 3.8099 37.7212 9.2906 76.4362 20.4196 22.8673 27.9689 23.2929 95.2622 33.4460 9.5072 20.7240 55.1095 103.8903 30.1451 31.4474 10.0200 12.3091 52.8786 42.0253 57.4210 12.5487 295.1017 0.9315 143.6157 27.5448 18.0122 20.5565 1.2530 4.3210 13.6772 18.2988 25.9502 4.4022 24.1487 19.7801 47.3987 48.2062 303.8644 4.7726 319.2941 490.6543 25.1290 30.9747 16.5810 10.4478 24.6785 15.0881 6.4471 5.6981 71.4880 8.4870 12.1077 10.2172 20.3479 28.3521 19.9080 14.1388 27.5539 12.2214 4.5489 11.6142 2.1325 15.8585 3.5275
temp: 298.150 k
press: 1.00000 atm
elementType: 8 8 8 8 8 8 6 6 6 6 6 6 6 6 6 6 6 6 6 6 6 6 6 6 6 6 1 1 1 1 1 1 1 1 1 1 1 1 1 1 1 1 1 1 1 1 1 1 1 1
symmnumber: 1
zpe: 1048411.6 jmol-1
zpe.correction: 0.399319 hartree
zpe.thermalcorrener: 0.425514 hartree
zpe.thermalcorrenthalpy: 0.426458 hartree
zpe.thermalcorrgfe: 0.344049 hartree
zpe.sumelectzpe: -1225.940978 hartree
zpe.sumelectthermal: -1225.914783 hartree
zpe.sumelectthermalent: -1225.913839 hartree
zpe.sumelectthermalfe: -1225.996248 hartree
dipole: -6.2767 -2.9555 -1.4037
dipole: 7.0783
quadrupole: -153.7753 -125.4445 -159.9567
quadrupole: -11.9966 -3.7115 2.4011
quadrupole: -7.3832 20.9477 -13.5645 -11.9966 -3.7115 2.4011
hfenergy: -1226.3402965 hartree
pointgroup: C01 [X(C20H24O6)]
dipole: -2.2958276 -1.4606685 -0.5922553 debye
polarizability: 321.3372118|-35.8854301|301.9631915|11.5262645|13.5272177|146.357521 unknown
InChI: InChI=1S/C20H24O6/c1-10-8-13(21)15-16(23)11-6-7-19(2,3)26-17(11)12(18(15)25-10)9-14(22)20(4,5)24/h6-8,14,22-24H,9H2,1-5H3
charge 0 multiplicity 1
50 atoms
O  -1.64053 1.653588 -0.554362
O  -1.114412 -2.149054 1.377136
O  -2.419769 -3.766517 -0.37429
O  1.555969 -1.917712 -0.512884
O  3.010355 2.634436 0.487475
O  4.654254 0.692324 0.494318
C  -1.993017 -1.537517 0.370146
C  -1.176901 -1.106655 -0.880213
C  -3.15357 -2.528285 0.039944
C  -0.066511 -0.141494 -0.52519
C  -0.324683 1.242312 -0.331939
C  -2.107672 2.985644 0.018126
C  0.684026 2.198559 -0.003687
C  1.269211 -0.543146 -0.336759
C  2.321483 0.35099 0.009762
C  2.011539 1.742673 0.171527
C  -4.052488 -2.048374 -1.116317
C  -3.981619 -2.819649 1.308889
C  -0.976698 4.002243 0.003317
C  0.328174 3.614118 0.047423
C  -2.577813 2.703647 1.464632
C  -3.272923 3.389363 -0.898983
C  3.686942 -0.127486 0.187288
C  2.858983 -2.390841 -0.335763
C  3.898928 -1.554657 -0.000368
C  2.934612 -3.872871 -0.556486
H  -2.413653 -0.644312 0.863825
H  -1.856237 -0.612455 -1.596098
H  -0.766482 -2.012961 -1.357617
H  -3.5037 -2.064512 -2.072174
H  -4.937806 -2.704106 -1.216923
H  -4.413498 -1.018331 -0.937012
H  -4.702762 -3.641252 1.1295
H  -3.315611 -3.094376 2.14354
H  -4.56346 -1.929003 1.609333
H  -1.263272 5.060001 0.002168
H  1.145598 4.339101 0.098312
H  -2.949007 3.633691 1.932256
H  -3.393335 1.957647 1.466955
H  -1.741141 2.324228 2.076263
H  -2.916957 3.552073 -1.929889
H  -4.042549 2.598252 -0.911187
H  -3.735885 4.323271 -0.532684
H  -0.872244 -3.040991 1.008342
H  -3.049092 -4.530106 -0.368378
H  4.905426 -1.957205 0.129137
H  3.89287 2.075529 0.56375
H  2.291992 -4.40693 0.167071
H  3.97001 -4.228138 -0.440681
H  2.576625 -4.135157 -1.568452
