program: Gaussian 09
title: 000183945
version: EM64L-G09RevD.01
frameworkgroup: C1[X(C8H9Cl2IN2)]
method: RPBEPBE
basis: SDD
operation: Freq
keyword: #p
keyword: freq=noraman
keyword: PBEPBE/SDD
title: #p freq=noraman PBEPBE/SDD
converged: YES YES NO NO
title: Mulliken charges:
elementType: I Cl Cl N N C C C C C C C C H H H H H H H H H
charge: 0.051327 -0.000627 0.011718 0.005502 0.003250 0.147957 0.623246 -0.793517 -0.680917 -0.715856 -0.221058 -0.436860 -0.274435 0.289271 0.307894 0.223368 0.231580 0.243134 0.224881 0.230711 0.240076 0.289355
chargesum: 0.00000
title: Mulliken charges with hydrogens summed into heavy atoms:
elementType: I Cl Cl N N C C C C C C C C
charge: 0.051327 -0.000627 0.011718 0.005502 0.003250 0.147957 0.623246 -0.196353 0.017166 -0.020187 0.068297 -0.436860 -0.274435
polarizability: 1.46392984e+02 -2.51602787e+01 1.49894012e+02 -3.13991589e+00 1.16785832e+00 1.17298013e+02
1716.lowfreq: -16.2047 -0.0016 -0.0016 -0.0009 1.7070 6.2225 31.2479 36.6906 72.6834
frequency: 31.2275 36.6226 72.6737 138.7460 150.2280 165.2193 200.2855 204.8305 226.0140 277.8474 313.4141 325.2151 333.4004 346.6838 347.2817 404.7768 440.7250 463.0585 513.7958 531.5359 586.4162 623.4423 649.6783 747.2491 781.5672 825.9920 884.0552 901.1975 929.4659 948.2687 995.7851 1005.0776 1029.7723 1079.0897 1100.4325 1128.6480 1152.5858 1194.7803 1225.4697 1249.2984 1283.2071 1324.3808 1379.9919 1399.1533 1435.7996 1446.3325 1466.4274 1473.8062 1488.4205 1496.6916 1530.3699 2986.8393 2992.4817 3062.3353 3082.3996 3087.8364 3089.8130 3115.5259 3156.9017 3205.4609
redmass: 14.0970 15.5113 14.8792 4.9560 3.6002 5.1745 1.1528 4.4278 4.2308 3.9779 11.1221 1.7765 1.6855 3.9281 4.7940 3.1951 5.8195 4.6019 3.8025 5.8430 5.1950 6.8701 6.8264 5.3604 4.6855 1.9722 2.1930 1.6692 1.6832 1.6020 6.8806 1.3250 5.0235 1.4774 2.4283 2.2566 3.9098 2.5661 1.5815 2.2921 2.6504 3.5223 1.1742 1.1798 1.1033 8.3467 1.0735 1.0555 1.0528 1.0595 5.9233 1.0359 1.0361 1.0590 1.1001 1.0994 1.0995 1.0992 1.1071 1.0924
irintensity: 0.4952 0.8818 1.4247 1.9020 1.8281 0.3149 0.0665 1.7163 0.9816 0.5958 1.0046 1.6114 1.9407 0.3100 0.2632 0.1004 4.5563 2.0399 8.9601 40.1625 22.0709 2.6024 3.9604 1.4838 0.9194 23.8941 13.2460 0.3755 20.2138 9.4279 3.9192 5.0988 16.0943 16.7926 146.9272 18.2289 3.8856 0.5702 52.3408 12.6818 154.3051 33.8532 19.7959 29.4034 7.9405 4.7481 5.1395 2.4257 11.8281 15.5134 50.1184 12.1316 29.4562 11.7603 0.0551 46.1471 26.0590 7.6292 1.5981 0.2494
temp: 298.150 k
press: 1.00000 atm
elementType: 53 17 17 7 7 6 6 6 6 6 6 6 6 1 1 1 1 1 1 1 1 1
symmnumber: 1
zpe: 407125.3 jmol-1
zpe.correction: 0.155066 hartree
zpe.thermalcorrener: 0.168806 hartree
zpe.thermalcorrenthalpy: 0.169750 hartree
zpe.thermalcorrgfe: 0.112206 hartree
zpe.sumelectzpe: -1350.355816 hartree
zpe.sumelectthermal: -1350.342076 hartree
zpe.sumelectthermalent: -1350.341132 hartree
zpe.sumelectthermalfe: -1350.398676 hartree
dipole: -2.9229 0.2098 5.5768
dipole: 6.2998
quadrupole: -119.4847 -106.2611 -104.7798
quadrupole: -5.4833 5.4383 5.1830
quadrupole: -9.3095 3.9141 5.3954 -5.4833 5.4383 5.1830
hfenergy: -1350.5108821 hartree
pointgroup: C01 [X(C8H9Cl2I1N2)]
dipole: -1.7375102 -1.2040388 1.2940219 debye
dipolederiv: -0.0890834 0.0197797 0.0453268 -0.0040871 -0.1101434 -0.1290724 -0.0248037 -0.0788765 -0.3819847 -0.4893912 0.3275536 -0.0463517 0.368709 -0.4706011 0.0325032 -0.0196013 0.0332846 -0.0736473 -0.5657708 0.365162 -0.0309 0.457802 -0.4350962 0.0368774 -0.0190842 0.0275054 -0.0489273 -0.3491909 0.382156 -0.0611868 -0.2522364 -0.1473151 0.0031138 0.062498 -0.0519098 -0.1649554 -0.1909392 -0.123463 0.0085591 0.4918791 -0.3815177 -0.0015832 -0.082291 0.0575148 -0.164055 0.1128233 0.1176494 0.2096485 0.1228848 0.0972351 -0.2152108 -0.00695 -0.0650242 -0.0863347 0.2864998 0.2362004 -0.0158868 0.1539849 -0.1277208 0.0500586 -0.0443274 0.0130398 0.0161698 -0.0236049 -0.0592243 -0.120837 -0.0831125 -0.0018376 0.2852302 0.0835831 0.2674295 0.7240027 -0.071379 -0.0555677 -0.1355822 -0.0680413 -0.0182712 0.1101227 -0.0358924 -0.0514119 -0.0753916 -0.0159947 -0.0354496 -0.0061347 -0.0180382 -0.0829926 0.0019207 0.0031749 0.0308353 -0.0068659 -0.417386 0.0895008 -0.0127178 0.1626207 -0.0789752 -0.0073301 0.0116716 0.0121549 -0.0154958 0.657484 -0.7445014 0.1002763 -0.5181365 0.6543361 -0.0557569 0.025773 -0.0317591 0.0757502 0.9371591 -0.5467217 0.03567 -0.8624142 0.7909186 -0.0516922 0.0337386 -0.064991 0.0928909 -0.0783633 -0.0400753 0.0371901 -0.0559304 0.0685029 -0.058872 0.0662803 -0.0248357 -0.0604223 0.1567037 0.0492278 0.0447744 0.0922912 -0.0057535 0.0281306 0.0196347 -0.0698646 -0.0692923 -0.1355809 -0.0639417 0.0680504 -0.0791289 0.0759441 0.0132746 0.058567 0.0054754 0.0947029 0.037797 0.0429448 -0.1025543 0.0352654 0.0713103 0.0132151 -0.0835889 -0.0086171 -0.1063986 0.1292424 0.0066527 -0.0061915 0.0344464 -0.0809546 -0.0271411 -0.0421826 0.0300967 0.1101603 0.0240373 0.0500746 -0.1285601 0.0186441 0.067848 0.0281655 -0.1118306 0.0347324 -0.0698818 -0.1417586 -0.0892332 0.0558212 -0.0194869 0.0762627 -0.0040027 0.0351838 0.01845 0.0978276 0.0774442 0.067925 0.0585147 0.0363797 0.0233834 -0.069545 0.0650713 -0.0963036 0.0004936 0.1492521 0.0033511 0.0030712 -0.014295 0.0154378 0.0175943 0.0053758 0.0130745 0.1116548 unknown
polarizability: 158.530641|-22.8102091|136.4422042|-3.9020514|5.3908131|118.6121644 unknown
InChI: InChI=1S/C8H9Cl2IN2/c1-8(2,4-11)5-3-6(9)12-13-7(5)10/h3H,4H2,1-2H3
charge 0 multiplicity 1
22 atoms
I  -1.98013 -1.00803 -2.560438
Cl -0.89433 2.730735 -0.179666
Cl 3.594523 -1.656337 0.088869
N  1.54654 1.7316 -0.283156
N  2.57634 0.812625 -0.237027
C  -1.594197 -0.460256 0.565925
C  -0.14978 -0.001153 0.264604
C  -2.560673 -0.126312 -0.60401
C  -2.125191 0.293408 1.834883
C  -1.667161 -1.980193 0.869933
C  0.921031 -0.920509 0.298333
C  0.277167 1.333119 -0.047204
C  2.233602 -0.464245 0.043641
H  -3.559009 -0.545372 -0.403319
H  -2.629765 0.949578 -0.810646
H  -3.152055 -0.045631 2.061996
H  -1.48779 0.056719 2.705385
H  -2.142481 1.386231 1.701616
H  -1.071512 -2.24482 1.761944
H  -2.716339 -2.25004 1.083812
H  -1.334583 -2.596478 0.016313
H  0.749896 -1.976237 0.507314
