program: Gaussian 09
title: 000183995
version: EM64L-G09RevD.01
frameworkgroup: C1[X(C20H22N2O)]
method: RPBEPBE
basis: SDD
operation: Freq
keyword: #p
keyword: freq=noraman
keyword: PBEPBE/SDD
title: #p freq=noraman PBEPBE/SDD
converged: YES YES NO NO
title: Mulliken charges:
elementType: O N N C C C C C C C C C C C C C C C C C C C C H H H H H H H H H H H H H H H H H H H H H H
charge: -0.235206 -0.106223 -0.101441 0.413956 -0.127441 0.454056 -0.535632 -0.121382 0.290101 -0.510716 -0.413314 0.320514 -0.387543 -0.420219 -0.230961 -0.687009 -0.394634 -0.247253 -0.697466 0.092086 -0.179247 -0.750773 -0.582906 0.236294 0.208553 0.249799 0.207041 0.241970 0.266266 0.237170 0.233126 0.221436 0.217140 0.234945 0.235477 0.230258 0.219532 0.214887 0.240359 0.290879 0.231859 0.236223 0.268030 0.230542 0.206868
chargesum: 0.00000
title: Mulliken charges with hydrogens summed into heavy atoms:
elementType: O N N C C C C C C C C C C C C C C C C C C C C
charge: -0.235206 -0.106223 -0.101441 0.413956 -0.127441 0.454056 -0.090784 -0.121382 0.290101 -0.053876 -0.171344 0.320514 -0.121277 -0.183049 0.002165 -0.013488 -0.159157 -0.016996 -0.022688 0.092086 0.111632 -0.014661 -0.145496
polarizability: 3.98619656e+02 3.62219529e+00 2.90994640e+02 -5.51612969e+00 -1.01800798e+01 1.38385473e+02
1716.lowfreq: -8.6134 -2.8131 -0.0009 -0.0009 -0.0007 3.7270 15.7172 37.6437 46.1731
frequency: 15.4379 37.6373 46.1638 53.4603 70.5898 75.4423 83.7036 108.8026 120.3421 139.5215 146.6686 155.1348 168.7755 183.9381 198.4307 211.5807 223.6049 234.6714 248.8894 270.0363 275.5703 309.0785 337.6183 349.6485 382.5745 395.2113 414.7350 436.8067 497.7365 504.0992 519.9527 530.4781 552.9529 556.9523 559.5853 570.4940 621.9069 637.5503 660.3378 696.7530 718.2696 761.8970 771.3699 778.9321 781.3546 809.3639 826.4622 829.9867 836.9134 873.0960 913.2203 915.9951 924.1797 941.8638 963.4714 982.5452 986.0433 990.3125 995.7129 1007.1069 1031.5197 1039.4268 1049.3711 1052.9535 1059.1519 1061.8655 1080.4192 1104.2941 1121.3740 1156.2640 1182.5237 1186.1254 1217.7233 1236.4168 1240.2113 1243.6470 1264.6586 1274.4061 1275.7381 1295.5456 1313.6119 1318.0262 1355.9813 1363.8653 1367.1741 1370.7950 1379.5237 1386.9227 1407.9801 1418.7474 1438.6706 1444.3390 1452.0720 1455.4164 1457.7438 1459.8813 1470.2442 1470.5556 1472.9707 1483.8936 1487.6448 1567.5926 1568.4427 1572.8366 1588.5349 1591.2285 1630.2915 2981.1200 2981.6673 2982.0337 2995.3511 2997.9825 3054.6125 3068.5731 3076.5437 3079.5528 3081.3551 3087.9566 3091.9984 3096.0177 3120.6411 3122.1198 3125.1472 3142.3112 3142.9337 3162.5387 3164.0819 3172.4863 3207.3398
redmass: 3.9969 4.2016 4.1947 3.6376 2.7382 3.5842 4.9605 3.1130 2.2411 2.9688 3.1232 3.4720 1.6041 2.4421 1.1204 1.6786 2.9603 2.3917 3.8688 3.6230 3.0057 3.8455 4.1510 3.1558 2.6691 3.5175 4.4714 4.2384 3.7413 4.1444 4.0874 3.9955 4.4733 2.6931 3.8544 3.4659 3.8113 4.2670 3.8240 2.5017 4.8406 1.8613 1.2831 1.6280 1.2699 2.0956 3.5363 3.1414 3.8585 3.6273 1.4104 1.8182 2.2053 1.3355 2.3183 1.3711 1.3711 2.1603 2.5011 1.6879 1.6213 1.2140 1.6825 1.7767 1.9211 2.0050 2.0668 2.4190 1.9085 2.3089 1.2815 1.2130 3.5765 1.9996 1.4271 1.7805 2.3928 1.8678 1.6598 1.3411 1.4705 1.5165 5.4069 5.2597 3.2899 1.5312 1.2081 1.2063 2.2968 3.0580 1.3936 1.3349 1.4489 1.2144 1.1796 2.1011 1.0828 1.0741 1.0469 1.0735 1.0801 7.0953 7.4147 7.1489 6.3010 5.4315 4.1311 1.0348 1.0350 1.0393 1.0653 1.0610 1.0996 1.0967 1.0918 1.0997 1.0971 1.1017 1.1010 1.0624 1.1021 1.0873 1.0875 1.0910 1.0910 1.0990 1.0980 1.0924 1.1108
irintensity: 0.1096 0.4828 1.3101 0.0330 0.8134 0.4295 3.1029 1.2451 2.4008 1.2152 0.0014 0.7323 0.5383 1.6082 0.3479 1.5621 3.0609 1.4216 0.5299 2.3324 0.2908 2.4435 3.4528 2.1951 1.6340 4.0465 2.8241 8.9893 5.1835 0.2514 5.1211 10.0694 2.9079 1.4721 3.0216 2.8635 9.9511 3.3907 7.0939 1.8863 0.5093 4.8743 9.6833 50.2231 20.3045 16.3355 9.0345 21.2056 3.1628 18.4608 1.1444 2.7910 0.8108 70.1811 5.9011 2.9659 0.9890 0.4628 2.5894 22.0708 4.3847 12.1411 3.5465 4.4774 7.3658 17.2594 6.3519 13.0408 8.9829 8.6642 12.5213 3.7613 13.0678 21.7608 1.4787 15.3407 46.3879 38.4943 6.4556 0.6378 3.5807 0.8347 3.6956 45.1740 18.8389 20.7373 16.7167 11.2655 0.8615 9.1907 16.3612 12.2425 8.2249 10.1231 7.2412 23.4908 6.6241 13.8968 15.4318 8.2602 9.7255 6.1659 127.8021 34.0645 14.2327 26.1571 1.5065 24.5330 48.0934 3.6694 39.9212 38.4273 3.3207 7.1126 7.7969 25.9758 47.9991 45.4246 41.0536 13.1143 10.9279 7.3734 11.1204 18.3317 9.8702 34.6647 31.0685 8.3883 10.9492
temp: 298.150 k
press: 1.00000 atm
elementType: 8 7 7 6 6 6 6 6 6 6 6 6 6 6 6 6 6 6 6 6 6 6 6 1 1 1 1 1 1 1 1 1 1 1 1 1 1 1 1 1 1 1 1 1 1
symmnumber: 1
zpe: 960684.8 jmol-1
zpe.correction: 0.365906 hartree
zpe.thermalcorrener: 0.388914 hartree
zpe.thermalcorrenthalpy: 0.389858 hartree
zpe.thermalcorrgfe: 0.312821 hartree
zpe.sumelectzpe: -958.340079 hartree
zpe.sumelectthermal: -958.317071 hartree
zpe.sumelectthermalent: -958.316127 hartree
zpe.sumelectthermalfe: -958.393163 hartree
dipole: 0.1425 -3.4822 1.3519
dipole: 3.7382
quadrupole: -110.8393 -137.6439 -139.8911
quadrupole: 1.1220 -0.0870 3.3500
quadrupole: 18.6188 -8.1858 -10.4330 1.1220 -0.0870 3.3500
hfenergy: -958.7059847 hartree
pointgroup: C01 [X(C20H22N2O1)]
dipole: -0.4325129 1.2954758 0.5455756 debye
polarizability: 388.7271503|28.3964614|298.8407987|18.0876823|17.5734281|140.4318197 unknown
InChI: InChI=1S/C20H22N2O/c1-5-15-10-8-11-16(6-2)19(15)21-22-20-17(7-3)12-9-13-18(20)14(4)23/h5,8-13H,1,6-7H2,2-4H3
charge 0 multiplicity 1
45 atoms
O  1.726631 -3.011548 -0.09876
N  0.452149 0.831667 0.064883
N  -0.261113 -0.220877 -0.242597
C  2.710168 1.720247 0.029578
C  1.85198 0.579446 0.147904
C  -2.468258 1.070537 -0.028741
C  2.148097 3.117521 -0.177234
C  -1.680534 -0.10961 -0.306704
C  2.397408 -0.734993 0.323532
C  -1.910106 2.412384 0.428279
C  4.10831 1.509956 0.043756
C  -2.32657 -1.343443 -0.70943
C  3.800181 -0.904315 0.298296
C  -3.871752 0.974645 -0.164411
C  4.654428 0.211958 0.160677
C  1.768538 3.393738 -1.65752
C  -3.741038 -1.369936 -0.824796
C  -4.508978 -0.226627 -0.552478
C  -1.569079 2.436699 1.942715
C  1.56226 -1.964252 0.594984
C  -1.524927 -2.549328 -1.017483
C  0.731011 -1.999149 1.878086
C  -2.006862 -3.819098 -1.134132
H  1.250658 3.25433 0.451724
H  2.901332 3.860254 0.147523
H  -1.001451 2.666741 -0.13993
H  -2.671544 3.189488 0.224372
H  4.774573 2.375735 -0.049004
H  4.21014 -1.914276 0.403263
H  -4.476675 1.866946 0.036115
H  5.740718 0.070936 0.159705
H  2.641445 3.265925 -2.322926
H  1.392389 4.426272 -1.777151
H  0.979728 2.697413 -1.993379
H  -4.233852 -2.288692 -1.156893
H  -5.59946 -0.25812 -0.654183
H  -2.451879 2.17216 2.552555
H  -1.231705 3.445469 2.244257
H  -0.757953 1.724755 2.173022
H  -0.450296 -2.392968 -1.141131
H  0.484723 -0.997093 2.263239
H  1.325583 -2.52963 2.648658
H  -0.192461 -2.577248 1.711159
H  -1.326535 -4.644428 -1.366841
H  -3.061118 -4.082293 -0.983657
