program: Gaussian 09
title: 000183951
version: EM64L-G09RevD.01
frameworkgroup: C1[X(C13H14O5)]
method: RPBEPBE
basis: SDD
operation: Freq
keyword: #pfreq=noraman
keyword: PBEPBE/SDD
title: #p freq=noraman PBEPBE/SDD
converged: YES YES NO NO
title: Mulliken charges:
elementType: O O O O O C C C C C C C C C C C C C H H H H H H H H H H H H H H
charge: -0.283802 -0.234565 -0.263341 -0.248557 -0.220867 -0.143852 -0.136014 -0.047599 -0.047956 -0.332461 -0.437787 0.019613 0.471588 -0.379159 -0.362101 -0.227176 -0.240062 -0.233551 0.262458 0.255631 0.284114 0.236403 0.236939 0.254418 0.217511 0.203828 0.213681 0.235420 0.256353 0.228143 0.231814 0.230936
chargesum: 0.00000
title: Mulliken charges with hydrogens summed into heavy atoms:
elementType: O O O O O C C C C C C C C C C C C C
charge: -0.283802 -0.234565 -0.263341 -0.248557 -0.220867 0.118607 0.119617 0.236514 0.188447 0.158896 -0.016448 0.233293 0.471588 -0.143739 -0.105748 0.000967 -0.008248 -0.002615
polarizability: 1.51473372e+02 -9.22084431e+00 1.65241589e+02 -1.53704343e+01 -6.70577561e+00 1.22718779e+02
1716.lowfreq: -8.2296 0.0005 0.0009 0.0010 3.6325 9.5424 14.5208 26.8218 33.3343
frequency: 14.0559 26.7549 33.2491 56.7191 58.2451 114.3757 134.7679 170.3708 205.7411 228.6214 250.2709 280.7867 284.8615 333.3694 365.4588 393.1801 403.4227 439.8143 460.7687 488.4708 510.0182 561.8860 587.0227 617.9092 695.0315 704.1973 736.1075 751.2310 773.6572 796.3734 814.6246 840.8437 859.6467 866.0113 914.3067 920.3543 931.6163 941.1636 958.9315 960.3563 982.2202 991.1102 996.0675 999.8307 1008.1611 1027.5974 1044.0010 1068.1337 1082.8144 1091.4572 1105.6887 1139.3480 1173.4056 1189.1417 1218.8728 1221.2532 1223.5657 1227.3896 1262.3152 1287.8495 1313.4223 1329.3671 1330.1650 1336.2323 1336.9637 1354.0697 1366.7358 1385.3465 1412.7070 1442.2274 1461.0314 1467.9047 1485.1195 1595.2423 1614.3781 1625.5816 2994.9799 3009.2989 3013.1387 3047.8194 3051.8733 3067.3056 3118.1715 3119.2739 3120.1571 3125.8410 3137.1643 3140.7086 3148.4164 3164.3084
redmass: 5.2763 5.1831 7.0586 5.1096 5.4849 5.1205 5.4883 5.5286 3.7737 3.6512 4.8057 5.4510 4.6859 2.3088 4.8924 4.9278 2.8273 4.9719 5.3846 4.9338 3.6748 6.2910 4.4398 6.3162 4.8207 1.8595 5.4614 2.4095 3.6867 4.7479 3.6606 3.5629 1.2815 4.9759 4.5271 3.7202 1.6398 2.3633 1.6135 3.3477 1.4039 5.3630 1.9926 1.3656 2.3190 2.2101 1.5629 2.4291 8.8336 1.5380 1.9820 1.9108 1.0541 1.1206 1.9406 1.2592 1.2387 1.3156 1.1904 1.2078 1.2159 1.3808 1.2680 1.3099 1.3269 1.2653 1.3569 8.0351 3.7503 2.1456 1.1276 1.0989 2.2792 6.0790 6.0522 9.0174 1.0589 1.0846 1.0644 1.0924 1.0844 1.1068 1.0955 1.0953 1.0863 1.0870 1.0919 1.0933 1.0963 1.1016
irintensity: 0.0395 0.5114 1.5732 0.3885 2.1391 1.2029 1.3253 3.2420 6.7840 9.1466 6.8673 12.5582 0.7545 2.5766 22.7328 16.3186 0.1344 17.7723 6.6183 8.7974 6.7683 15.0545 18.5973 0.2417 10.9813 49.5064 15.6438 44.1648 26.0441 21.6266 9.1956 20.9368 0.4171 14.9222 26.0387 26.1402 55.9891 59.7509 2.2299 196.9083 1.1670 0.6341 4.0477 0.5846 97.1025 2.2553 9.6172 18.0684 345.7276 7.5932 2.1314 3.2676 0.0180 0.3922 7.4677 4.0455 7.3094 27.3868 3.6150 8.1828 4.9839 0.8295 0.8147 7.8112 3.4113 6.8288 12.1303 0.2355 1.2658 8.6541 9.2049 9.5863 5.8624 0.5046 0.5721 260.7732 41.4815 54.2030 11.0650 48.6513 5.7801 20.1043 7.8717 4.0834 4.7421 0.3840 12.3308 13.1017 35.3474 20.4840
temp: 298.150 k
press: 1.00000 atm
elementType: 8 8 8 8 8 6 6 6 6 6 6 6 6 6 6 6 6 6 1 1 1 1 1 1 1 1 1 1 1 1 1 1
symmnumber: 1
zpe: 651604.5 jmol-1
zpe.correction: 0.248183 hartree
zpe.thermalcorrener: 0.264317 hartree
zpe.thermalcorrenthalpy: 0.265261 hartree
zpe.thermalcorrgfe: 0.201360 hartree
zpe.sumelectzpe: -878.484297 hartree
zpe.sumelectthermal: -878.468163 hartree
zpe.sumelectthermalent: -878.467219 hartree
zpe.sumelectthermalfe: -878.531120 hartree
dipole: -2.4786 -0.0774 2.3201
dipole: 3.3959
quadrupole: -106.2944 -101.0916 -104.1328
quadrupole: 0.9155 6.6970 3.2295
quadrupole: -2.4548 2.7480 -0.2932 0.9155 6.6970 3.2295
hfenergy: -878.7324798 hartree
pointgroup: C01 [X(C13H14O5)]
dipole: 0.9899326 0.1851799 0.8779505 debye
polarizability: 151.5246311|-5.6105617|166.4825415|16.5136496|-2.4927296|121.4265671 unknown
InChI: InChI=1S/C13H14O5/c14-8-17-10-7-16-13(12-11(10)18-12)15-6-9-4-2-1-3-5-9/h1-5,8,10-13H,6-7H2
charge 0 multiplicity 1
32 atoms
O  -3.067862 2.059201 -0.701745
O  -0.677247 0.404248 -1.448954
O  0.6186 1.876763 -0.012261
O  -2.796463 -1.139967 1.249656
O  -3.246237 -3.043435 -0.047131
C  -2.701374 1.11981 0.423263
C  -1.720683 2.158357 -0.026404
C  -2.50652 -0.335733 0.016036
C  -0.533103 1.748062 -0.887821
C  -1.058136 -0.605276 -0.440065
C  1.943744 1.731309 -0.696512
C  -3.160244 -2.467879 1.053486
C  2.637396 0.438247 -0.317434
C  3.511244 0.403794 0.798804
C  2.431905 -0.748749 -1.066477
C  4.163652 -0.794557 1.166399
C  3.086479 -1.946641 -0.704903
C  3.953699 -1.972986 0.413299
H  -3.266306 1.274412 1.350155
H  -1.566599 3.064173 0.569663
H  -3.224869 -0.622739 -0.77259
H  -0.435785 2.386421 -1.788135
H  -0.370379 -0.562913 0.426011
H  -0.97103 -1.575688 -0.949909
H  2.529385 2.60343 -0.355842
H  1.790967 1.79516 -1.791009
H  -3.361604 -2.919642 2.04263
H  3.678409 1.317985 1.381893
H  1.750369 -0.727427 -1.925246
H  4.83642 -0.808793 2.031195
H  2.924608 -2.856302 -1.293973
H  4.462961 -2.902143 0.69292
