program: Gaussian 09
title: 000183955
version: EM64L-G09RevD.01
frameworkgroup: C1[X(C19H14INO)]
method: RPBEPBE
basis: SDD
operation: Freq
keyword: #p
keyword: freq=noraman
keyword: PBEPBE/SDD
title: #p freq=noraman PBEPBE/SDD
converged: YES YES NO NO
title: Mulliken charges:
elementType: I O N C C C C C C C C C C C C C C C C C C C H H H H H H H H H H H H H H
charge: 0.096370 -0.207363 -0.318796 0.380666 0.426846 0.000153 0.409771 -0.344388 -0.361867 -0.347150 -0.317110 -0.496175 -0.341857 -0.217536 -0.217727 -0.209917 -0.228996 -0.244352 -0.247340 -0.168797 -0.234857 -0.223407 0.250952 0.258106 0.273185 0.270051 0.260513 0.230615 0.226696 0.230668 0.229523 0.231264 0.229355 0.249881 0.235873 0.237148
chargesum: 0.00000
title: Mulliken charges with hydrogens summed into heavy atoms:
elementType: I O N C C C C C C C C C C C C C C C C C C C
charge: 0.096370 -0.207363 -0.318796 0.380666 0.426846 0.000153 0.409771 -0.093437 -0.103761 -0.073965 -0.047059 -0.496175 -0.081344 0.013079 0.008969 0.020751 0.000527 -0.013088 -0.017985 0.081083 0.001016 0.013741
polarizability: 2.72327455e+02 3.74200477e+01 2.24203015e+02 1.84146757e+01 8.02468762e+00 2.01343870e+02
1716.lowfreq: -7.9592 0.0003 0.0005 0.0005 5.8871 9.8486 21.3462 25.0771 37.4259
frequency: 20.6808 24.9022 37.4091 51.2254 69.2492 76.6469 89.4326 102.6560 127.8003 154.5424 213.2098 236.8245 254.2873 271.0312 286.6043 310.9489 353.2637 395.2715 405.0408 411.9201 440.9790 450.3907 509.9322 527.3298 540.7003 611.4015 615.6111 616.8663 630.9940 656.8526 691.0166 695.1755 698.7099 705.9819 733.7397 760.1709 764.7633 768.1270 832.8910 841.1217 842.8218 873.5378 912.2580 916.8195 940.2090 955.4721 970.4760 972.5004 988.2449 989.5648 990.3159 990.8293 993.4824 994.9275 1023.4331 1028.5975 1035.5217 1081.1656 1086.9931 1104.3192 1117.4680 1172.3219 1172.9205 1175.2252 1184.2147 1188.6013 1206.9281 1257.4169 1267.1183 1289.9908 1316.7264 1327.2791 1357.4471 1377.4486 1387.0147 1413.0663 1437.8376 1444.3777 1448.5115 1479.7706 1481.6406 1560.7750 1564.9280 1591.0135 1591.5542 1595.9899 1604.7860 1613.0217 3129.1351 3130.7367 3133.5187 3139.4815 3140.2298 3144.1999 3153.3064 3154.5555 3160.4521 3163.2049 3165.8682 3172.9257 3174.0248 3184.3343
redmass: 6.3412 8.0708 4.4494 5.2701 4.4193 4.8843 5.8500 8.8879 4.9088 6.3580 6.0212 5.3126 4.5748 5.7455 6.7425 5.5738 7.4019 4.5216 2.8605 2.8807 5.1309 3.9560 4.1799 3.8547 4.6943 5.6188 5.5045 6.1425 6.7239 6.8933 4.0260 2.3493 1.9658 7.1066 2.6069 1.9212 1.7230 1.5544 2.3987 1.5452 1.3165 1.4275 1.5425 1.4506 4.4943 1.4088 1.3833 1.3878 4.7215 4.2200 1.5123 1.4347 1.7502 2.8918 2.5435 2.0013 2.5152 1.5944 1.6175 2.3970 1.7636 1.0516 1.0492 1.0602 1.1179 1.1605 2.8240 1.6006 3.8268 3.1683 1.4228 1.4417 9.1387 7.9004 9.8218 2.1356 2.2824 2.3272 2.4322 2.3469 2.2702 9.0758 6.7555 6.5373 6.6105 6.6004 6.0927 6.2771 1.0849 1.0849 1.0860 1.0892 1.0888 1.0903 1.0940 1.0930 1.0951 1.0962 1.0992 1.1009 1.1001 1.0965
irintensity: 0.6903 1.0201 0.3835 0.1951 0.1760 0.6767 0.9615 1.4402 0.8040 1.5438 0.4839 2.0106 1.7338 1.0074 1.5542 0.8090 10.0811 1.5478 1.2263 0.6316 2.7387 9.4595 5.6004 19.3398 2.9504 7.4351 21.1612 7.0404 8.8814 17.5062 9.4643 37.5491 42.0102 13.0223 21.0991 24.7309 75.2630 68.1884 1.4779 2.9739 2.8495 1.3429 0.7377 0.8538 12.6268 2.3661 0.4180 0.7733 1.2941 1.1571 2.9505 0.2618 11.3628 24.1374 0.2044 15.0320 11.6690 6.9758 10.5372 20.0194 13.1173 0.0048 0.0410 0.3254 0.4223 2.4377 2.1179 37.5584 56.3743 320.3786 33.4401 32.8991 7.4981 2.3670 0.5763 35.2806 10.1661 5.1200 10.3619 51.8066 84.9404 160.7890 85.5683 7.1520 20.5676 6.8006 32.6414 10.1302 0.9383 0.5943 0.7594 10.2463 7.3278 6.0480 32.5852 24.3415 12.0436 14.2145 25.4177 6.8636 19.7813 2.1050
temp: 298.150 k
press: 1.00000 atm
elementType: 53 8 7 6 6 6 6 6 6 6 6 6 6 6 6 6 6 6 6 6 6 6 1 1 1 1 1 1 1 1 1 1 1 1 1 1
symmnumber: 1
zpe: 714461.0 jmol-1
zpe.correction: 0.272124 hartree
zpe.thermalcorrener: 0.290839 hartree
zpe.thermalcorrenthalpy: 0.291783 hartree
zpe.thermalcorrgfe: 0.221783 hartree
zpe.sumelectzpe: -872.396258 hartree
zpe.sumelectthermal: -872.377543 hartree
zpe.sumelectthermalent: -872.376598 hartree
zpe.sumelectthermalfe: -872.446599 hartree
dipole: 0.9357 3.4604 -2.0347
dipole: 4.1219
quadrupole: -124.1100 -131.9060 -142.3544
quadrupole: 6.0625 6.9569 7.2309
quadrupole: 8.6801 0.8842 -9.5643 6.0625 6.9569 7.2309
hfenergy: -872.6683819 hartree
pointgroup: C01 [X(C19H14I1N1O1)]
dipole: -0.5647586 -1.513977 -0.1367897 debye
polarizability: 283.0742429|16.9049134|207.4180848|-29.2768605|-8.0526762|207.3820133 unknown
InChI: InChI=1S/C19H14INO/c20-18-14-8-7-13-17(18)19(22)21(15-9-3-1-4-10-15)16-11-5-2-6-12-16/h1-14H
charge 0 multiplicity 1
36 atoms
I  -1.373318 1.459866 -2.48949
O  0.356252 2.266608 1.23223
N  0.684555 0.165141 0.227856
C  0.141972 -1.151848 -0.055995
C  2.117048 0.3478 0.084058
C  -0.123228 1.215001 0.715982
C  -1.626051 1.04597 0.615212
C  -0.556745 -1.872169 0.942811
C  2.994441 -0.707836 0.436526
C  0.35771 -1.73588 -1.328487
C  2.641732 1.562303 -0.423995
C  -2.35483 1.10456 -0.597667
C  -2.358057 0.966905 1.830621
C  -1.066233 -3.157951 0.657129
C  4.387926 -0.549266 0.277745
C  -0.141715 -3.026061 -1.603306
C  4.036221 1.712861 -0.572429
C  -0.861361 -3.73942 -0.615171
C  4.916686 0.661358 -0.225277
C  -3.765249 1.017251 -0.609764
C  -3.763366 0.878355 1.833601
C  -4.468827 0.889582 0.608318
H  -0.691141 -1.432875 1.936125
H  2.58861 -1.644123 0.832779
H  0.909783 -1.175225 -2.088726
H  1.966804 2.379835 -0.687762
H  -1.801293 0.985582 2.774081
H  -1.610857 -3.707982 1.432236
H  5.058335 -1.370593 0.554109
H  0.023718 -3.470496 -2.590783
H  4.434915 2.65548 -0.963195
H  -1.25213 -4.739245 -0.833276
H  5.998688 0.784788 -0.343304
H  -4.310257 1.06404 -1.556737
H  -4.305068 0.808951 2.782553
H  -5.561774 0.821032 0.593394
