program: Gaussian 09
title: 000183943
version: EM64L-G09RevD.01
frameworkgroup: C1[X(C15H10O3)]
method: RPBEPBE
basis: SDD
operation: Freq
keyword: #pfreq=noraman
keyword: PBEPBE/SDD
title: #p freq=noraman PBEPBE/SDD
converged: YES YES NO YES
title: Mulliken charges:
elementType: O O O C C C C C C C C C C C C C C C H H H H H H H H H H
charge: -0.403694 -0.422196 -0.348384 0.189421 0.515090 0.409221 0.400994 -0.584671 -0.666752 0.007315 -0.468755 0.092665 -0.416041 -0.419905 -0.356300 -0.242151 -0.235707 0.160263 0.287679 0.249694 0.244520 0.247637 0.268171 0.242723 0.231411 0.230437 0.397020 0.390296
chargesum: 0.00000
title: Mulliken charges with hydrogens summed into heavy atoms:
elementType: O O O C C C C C C C C C C C C C C C
charge: -0.006674 -0.031900 -0.348384 0.189421 0.515090 0.409221 0.400994 -0.296992 -0.417058 0.007315 -0.224236 0.092665 -0.168404 -0.177183 -0.088129 -0.010740 -0.005270 0.160263
polarizability: 3.65579922e+02 1.17350112e+01 1.79272872e+02 -1.26766394e-02 2.49415572e-03 6.51672219e+01
1716.lowfreq: -8.6372 -0.0008 -0.0008 0.0004 5.9628 12.5870 53.3117 85.3705 122.6010
frequency: 53.3003 85.3674 122.6008 140.1672 145.1007 220.3577 251.4275 276.0935 282.7762 300.7367 358.8101 406.9832 408.9059 461.3732 475.7309 502.5429 518.8697 533.8377 561.7467 584.7890 590.1595 616.6343 631.6323 631.6355 709.9440 713.2287 755.8514 758.8783 778.2474 791.3657 804.8462 818.8042 866.4634 886.5330 906.1002 918.3595 927.3222 945.7421 972.8410 981.1587 993.9122 1015.7806 1032.2365 1098.1990 1139.3906 1172.3242 1174.9933 1190.5450 1206.9186 1226.4084 1275.1642 1281.3052 1302.3538 1321.8239 1357.0437 1407.7292 1414.6464 1426.5556 1431.0316 1451.5944 1452.9820 1479.3301 1540.0138 1563.5242 1580.4058 1603.5069 1636.6872 1638.8607 2866.3900 3122.1734 3123.6576 3129.2367 3139.9555 3145.5649 3155.5488 3164.0317 3175.9854 3529.7780
redmass: 6.7967 5.2243 5.5497 6.6178 9.1441 4.8001 5.7670 5.2986 7.7615 4.0829 5.7690 3.2406 6.8010 8.6302 2.5160 3.1980 6.4084 6.6244 1.9960 5.9232 1.7812 6.6210 4.9688 4.3510 6.6450 3.9408 5.3745 1.2832 3.3714 5.1909 3.0966 1.4595 1.4729 4.8684 1.0888 1.5142 5.0099 1.7997 1.4110 1.3589 1.3554 2.3346 3.8187 1.9788 1.5923 1.2281 1.4547 1.3528 1.6724 1.8610 2.2909 1.5710 3.0097 2.3738 3.2215 3.9957 2.4930 2.4837 7.9186 4.6749 3.3435 2.9744 4.5253 7.1570 4.9033 4.8164 6.0607 5.3427 1.0712 1.0888 1.0884 1.0886 1.0888 1.0954 1.0918 1.1004 1.0962 1.0641
irintensity: 1.1731 0.1943 0.5503 1.2091 0.0000 0.3659 0.4562 0.0001 2.1247 4.8284 3.5595 2.0510 7.9277 3.5481 23.3151 14.6074 1.2035 34.8457 42.3537 12.1853 77.1408 0.7392 33.3758 7.3885 4.5483 35.4554 0.3497 66.9402 3.6815 3.8365 0.2686 7.4787 3.1502 14.1984 122.9294 97.7971 33.7373 0.2530 13.7730 4.1511 0.0061 17.9756 261.0789 272.1773 34.7235 22.4361 39.2733 15.5148 29.4912 17.4000 17.4033 2.7005 123.7805 24.7754 67.4601 45.9166 64.2630 156.7325 28.8164 63.7407 90.3219 6.6006 81.5139 32.8376 31.4958 155.8371 17.4349 264.2301 379.3642 0.9128 8.7542 0.1296 8.4074 30.6865 0.1898 43.4479 6.0206 97.1897
temp: 298.150 k
press: 1.00000 atm
elementType: 8 8 8 6 6 6 6 6 6 6 6 6 6 6 6 6 6 6 1 1 1 1 1 1 1 1 1 1
symmnumber: 1
zpe: 548277.6 jmol-1
zpe.correction: 0.208828 hartree
zpe.thermalcorrener: 0.222090 hartree
zpe.thermalcorrenthalpy: 0.223034 hartree
zpe.thermalcorrgfe: 0.169139 hartree
zpe.sumelectzpe: -802.090658 hartree
zpe.sumelectthermal: -802.077396 hartree
zpe.sumelectthermalent: -802.076452 hartree
zpe.sumelectthermalfe: -802.130346 hartree
dipole: -0.8779 1.6691 0.0021
dipole: 1.8858
quadrupole: -80.4736 -97.3524 -109.0032
quadrupole: 4.1018 0.0014 -0.0003
quadrupole: 15.1361 -1.7427 -13.3935 4.1018 0.0014 -0.0003
hfenergy: -802.2994854 hartree
pointgroup: C01 [X(C15H10O3)]
dipole: -0.3419065 -0.6580707 0.0229515 debye
polarizability: 365.6627107|-10.8479238|179.0563641|-2.9391222|-3.3455743|65.3009407 unknown
InChI: InChI=1S/C15H10O3/c16-14-12(15(17)18)6-5-11-7-9-3-1-2-4-10(9)8-13(11)14/h1-8,16-17H
charge 0 multiplicity 1
28 atoms
O  1.819189 2.070481 -0.107881
O  5.062712 -0.628092 -0.063725
O  4.327095 1.56737 -0.122015
C  0.242714 0.248861 -0.035315
C  -0.008688 -1.186046 0.010876
C  -2.179185 0.70367 -0.023303
C  -2.441941 -0.730866 0.022934
C  -0.836205 1.158693 -0.051263
C  -1.347643 -1.635946 0.038862
C  1.61294 0.714281 -0.064576
C  1.111413 -2.101843 0.026513
C  2.689106 -0.215506 -0.048648
C  -3.292569 1.616235 -0.039449
C  -3.808594 -1.182153 0.050882
C  2.411442 -1.632759 -0.002302
C  -4.601963 1.143532 -0.01154
C  -4.861197 -0.270127 0.03409
C  4.043337 0.314784 -0.080552
H  -0.618278 2.23102 -0.086105
H  -1.546616 -2.714288 0.073739
H  0.91108 -3.178044 0.061627
H  -3.089949 2.693076 -0.074318
H  3.262522 -2.319081 0.00915
H  -4.008583 -2.259664 0.085727
H  -5.442977 1.845075 -0.024198
H  -5.897274 -0.625652 0.055583
H  2.836361 2.234957 -0.124549
H  5.937651 -0.155467 -0.088543
