program: Gaussian 09
title: 000183906
version: EM64L-G09RevD.01
frameworkgroup: C1[X(C15H14Cl2N2O)]
method: RPBEPBE
basis: SDD
operation: Freq
keyword: #p
keyword: freq=noraman
keyword: PBEPBE/SDD
title: #p freq=noraman PBEPBE/SDD
converged: NO YES YES YES
title: Mulliken charges:
elementType: Cl Cl O N N C C C C C C C C C C C C C C C H H H H H H H H H H H H H H
charge: -0.066399 -0.066399 -0.282140 -0.507438 -0.507439 0.503834 0.503830 0.534090 0.534091 -0.469211 -0.469212 -0.345961 -0.345956 -0.246309 -0.246309 -0.395673 -0.395678 0.274047 -0.797893 -0.797894 0.244586 0.244587 0.309007 0.309010 0.235106 0.235106 0.293715 0.293715 0.244185 0.244185 0.224223 0.224223 0.244186 0.244184
chargesum: 0.00000
title: Mulliken charges with hydrogens summed into heavy atoms:
elementType: Cl Cl O N N C C C C C C C C C C C C C C C
charge: -0.066399 -0.066399 -0.282140 -0.213723 -0.213723 0.503834 0.503830 0.534090 0.534091 -0.224625 -0.224625 -0.036954 -0.036946 -0.246309 -0.246309 -0.160568 -0.160573 0.274047 -0.085300 -0.085301
polarizability: 3.82098306e+02 4.08920403e-05 2.04026146e+02 -7.64202892e-03 8.32327748e-03 8.53051949e+01
1716.lowfreq: 0.0013 0.0016 0.0019 2.2584 6.4658 12.1637 20.3684 26.1451 49.8342
frequency: 20.2137 25.3355 49.8342 61.5964 69.6441 112.5815 113.7690 139.7520 141.1444 141.5967 157.6344 186.3435 188.1330 231.4834 235.6429 272.4172 300.9841 315.1078 330.2246 391.2975 398.2199 436.3793 439.7055 439.8665 456.0233 458.2790 469.2495 578.2778 586.1491 588.8331 618.1876 664.7103 685.6798 695.7721 697.9226 701.2804 737.5877 780.0313 789.5767 841.0792 842.7265 855.7042 858.1203 863.8501 898.2015 979.6793 981.2554 996.9206 998.4091 1015.4223 1025.9541 1030.4999 1046.6339 1046.6709 1156.3770 1156.6401 1179.1576 1214.3098 1218.1857 1255.0488 1264.2650 1286.6042 1301.7512 1344.6230 1356.1745 1400.2021 1402.2674 1405.6343 1406.5905 1462.7571 1462.7693 1463.6112 1468.0460 1491.5932 1491.6854 1507.4414 1517.3687 1580.3498 1586.3980 1625.4247 1626.7670 1652.0892 2983.6057 2983.6677 3062.0463 3062.0570 3094.3236 3094.3324 3133.5676 3133.6656 3136.3945 3136.4544 3202.6205 3202.8719 3519.9713 3532.4332
redmass: 5.8849 5.3909 7.8581 4.6163 8.8621 1.1621 1.1215 2.6010 2.5636 8.2132 9.4911 5.5435 4.1606 4.3383 6.0087 4.5305 10.1566 2.6762 3.8674 7.1608 8.1683 2.3921 3.9057 3.0440 3.6854 1.9139 7.6907 3.0700 6.3155 4.2424 1.3566 7.4970 7.5565 6.7290 2.7729 3.3791 4.7512 7.0017 5.0804 1.2886 1.2905 1.6165 1.6081 6.6325 5.6864 1.3159 1.3125 1.4488 1.4662 7.0323 3.0857 2.8428 1.5072 1.5072 1.3096 1.2779 2.6649 1.6558 1.8104 2.8353 1.8019 1.6083 2.2031 3.9406 4.4086 2.3983 1.6236 1.6746 2.3855 1.0446 1.0445 1.2936 1.2082 2.8748 1.8874 2.0940 2.7599 4.1814 4.6598 7.3456 6.6839 3.8786 1.0370 1.0370 1.0974 1.0974 1.0995 1.0995 1.0919 1.0919 1.0915 1.0915 1.0943 1.0942 1.0767 1.0757
irintensity: 0.0000 0.0150 0.0614 0.0000 13.4755 2.4147 0.0001 1.3031 0.0001 8.1071 0.0017 4.6550 0.0000 3.3881 2.8972 1.6063 3.3459 0.0000 1.4545 3.0506 1.5078 0.0000 7.4889 12.8272 0.9265 0.0000 27.3583 58.7029 2.7373 0.0000 101.8106 8.0624 18.6292 35.3453 0.0000 0.7243 7.0314 0.6170 2.4176 0.0000 5.4767 0.0000 147.3372 32.6546 8.6512 0.0000 10.0843 50.9700 2.3320 41.7057 56.7528 13.2050 0.0046 16.1544 0.1457 6.6797 447.0247 51.1899 2.7264 63.0527 21.0808 97.8477 13.7359 23.9152 373.2533 1.0657 59.7432 4.3373 3.2337 0.0271 28.3335 9.8087 96.4708 357.3288 18.2799 1143.8044 5.1057 179.3074 96.7999 164.2680 3.0244 93.7815 55.0533 7.3979 6.6950 24.2555 0.5599 31.4940 16.0775 16.6160 0.3090 12.9593 15.2384 0.3118 6.9238 16.8180
temp: 298.150 k
press: 1.00000 atm
elementType: 17 17 8 7 7 6 6 6 6 6 6 6 6 6 6 6 6 6 6 6 1 1 1 1 1 1 1 1 1 1 1 1 1 1
symmnumber: 1
zpe: 673196.9 jmol-1
zpe.correction: 0.256407 hartree
zpe.thermalcorrener: 0.275994 hartree
zpe.thermalcorrenthalpy: 0.276939 hartree
zpe.thermalcorrgfe: 0.206094 hartree
zpe.sumelectzpe: -1683.454666 hartree
zpe.sumelectthermal: -1683.435079 hartree
zpe.sumelectthermalent: -1683.434135 hartree
zpe.sumelectthermalfe: -1683.504979 hartree
dipole: 0.0001 0.8806 0.0000
dipole: 0.8806
quadrupole: -134.9329 -123.6053 -136.8087
quadrupole: -0.0001 -0.0006 -0.0006
quadrupole: -3.1506 8.1770 -5.0264 -0.0001 -0.0006 -0.0006
hfenergy: -1683.7110735 hartree
pointgroup: C01 [X(C15H14Cl2N2O1)]
dipole: -0.0000041 -0.3464583 0.0000006 debye
polarizability: 382.0983041|0.0161926|204.0261471|0.0076428|-0.0083226|85.3051949 unknown
InChI: InChI=1S/C15H14Cl2N2O/c1-9-3-5-11(7-13(9)16)18-15(20)19-12-6-4-10(2)14(17)8-12/h3-8,18-19H,1-2H3
charge 0 multiplicity 1
34 atoms
Cl -6.127603 -2.127396 0.000188
Cl 6.126195 -2.126275 0.000417
O  -0.001011 1.42669 -0.000288
N  -1.166606 -0.625373 -0.000163
N  1.164913 -0.625176 -0.000128
C  -2.515752 -0.174701 -0.000135
C  2.513977 -0.17426 -0.000025
C  -5.303378 0.559211 -0.00006
C  5.301462 0.560175 0.000214
C  -3.526363 -1.173344 -0.000009
C  3.524774 -1.172715 0.000116
C  -2.895543 1.193014 -0.000223
C  2.893509 1.193526 -0.00005
C  -4.876007 -0.789689 0.000025
C  4.874346 -0.788806 0.000231
C  -4.265252 1.526825 -0.000185
C  4.263154 1.527594 0.000068
C  -0.000912 0.161851 -0.000299
C  -6.764785 0.956199 -0.00003
C  6.762795 0.957436 0.000351
H  -3.265485 -2.237885 0.000059
H  3.264097 -2.237305 0.000134
H  -2.125927 1.965415 -0.000321
H  2.123743 1.965779 -0.000167
H  -4.546939 2.586193 -0.000254
H  4.544642 2.587015 0.000046
H  -1.057213 -1.641676 -0.000044
H  1.055695 -1.641497 -0.000066
H  -7.290831 0.557049 -0.886722
H  -7.290798 0.557046 0.886678
H  -6.870482 2.053829 -0.000029
H  6.86829 2.055086 0.000192
H  7.288774 0.558526 0.887189
H  7.289022 0.55824 -0.88621
