program: Gaussian 09
title: 000183896
version: EM64L-G09RevD.01
frameworkgroup: C1[X(C11H14NO2)]
method: RPBEPBE
basis: SDD
operation: Freq
keyword: #p
keyword: freq=noraman
keyword: PBEPBE/SDD
title: #p freq=noraman PBEPBE/SDD
converged: YES YES NO NO
title: Mulliken charges:
elementType: O O N C C C C C C C C C C C H H H H H H H H H H H H H H
charge: -0.256359 -0.407628 -0.043353 -0.548516 -0.409680 0.443323 0.361500 -0.253462 -0.569307 -0.494233 -0.589491 0.219998 0.211827 -0.485670 0.261980 0.262880 0.282069 0.265314 0.288927 0.249074 0.279548 0.251428 0.274488 0.272037 0.392271 0.252227 0.245024 0.243782
chargesum: 1.00000
title: Mulliken charges with hydrogens summed into heavy atoms:
elementType: O O N C C C C C C C C C C C
charge: -0.256359 -0.015357 -0.043353 -0.023655 0.137703 0.443323 0.361500 0.035465 -0.320233 -0.214686 0.208463 0.219998 0.211827 0.255363
polarizability: 2.40899169e+02 1.13302817e+01 1.35527608e+02 -7.25090671e-02 7.44851418e-01 6.88492026e+01
1716.lowfreq: -29.3435 -0.0007 -0.0004 -0.0002 4.6255 5.3247 10.0092 70.7686 99.2632
frequency: -29.2928 70.7486 99.2557 144.3645 162.4190 177.2552 188.6516 228.4239 269.7555 278.5196 317.4877 349.9189 377.4777 388.1538 421.8987 425.4507 432.9887 451.2106 511.2685 569.8110 638.5870 649.8216 707.9468 713.8383 726.8772 769.5315 844.9860 859.7619 879.4790 915.7361 953.4056 958.6188 1002.2811 1055.6512 1085.4569 1098.1066 1107.1716 1115.9112 1132.2989 1147.7466 1174.2742 1202.4904 1210.2416 1243.5527 1267.5035 1282.2325 1323.7476 1342.1941 1348.7228 1381.1041 1415.6611 1433.3098 1437.3982 1451.9931 1453.6974 1458.6645 1460.2435 1462.7784 1467.3129 1484.7545 1516.3624 1565.5349 1620.7194 1628.8774 2981.2997 2995.6352 3001.7955 3017.6495 3069.2649 3089.3315 3093.5952 3119.5404 3129.2733 3132.9097 3147.7786 3151.9009 3160.6472 3564.8432
redmass: 3.0253 3.9590 3.1816 2.6527 1.0834 1.2726 3.1769 2.7794 3.3982 3.3712 4.5248 4.5553 3.2713 5.1042 3.3068 1.3543 2.3281 3.0438 4.0280 4.3708 4.5246 5.6231 4.2572 5.6303 3.7028 2.3391 3.6625 1.4682 1.4217 2.9692 3.2104 1.6633 2.5012 2.0741 1.8426 2.1206 1.2374 1.3328 2.1984 1.3294 1.7661 1.4957 1.4019 1.7308 1.6423 1.6238 2.3306 1.6135 1.5199 2.7512 1.7423 2.2586 1.6809 1.2402 1.1945 1.0687 1.0997 1.0516 1.0798 1.1767 4.0453 5.5062 6.9450 4.7641 1.0689 1.0625 1.0361 1.0286 1.0944 1.0993 1.1026 1.0921 1.1027 1.1064 1.0940 1.1058 1.0926 1.0665
irintensity: 8.7898 3.8160 0.4141 0.3571 0.2277 0.5672 2.5419 1.7307 0.9313 3.0809 6.9486 4.3770 1.6593 29.3813 14.7550 138.1116 1.7439 7.7069 6.9114 4.2666 19.5119 7.5678 2.6877 1.4609 1.2637 5.5211 0.3245 11.0188 26.2347 13.7215 29.7655 22.3606 5.8472 7.6166 25.7234 123.0198 0.0031 1.2164 82.7188 25.1812 15.8160 32.9776 44.2464 118.0937 78.3482 237.5538 308.8904 47.5664 37.0773 49.8773 15.7209 24.4667 7.5434 12.6394 13.1880 44.1935 34.2051 17.1325 2.1041 13.4092 24.2794 344.3012 69.2366 314.9318 8.3845 10.0844 16.8828 40.0424 5.5828 7.8013 4.8067 5.0627 4.0395 23.2413 0.3660 10.8511 1.2624 152.2317
temp: 298.150 k
press: 1.00000 atm
elementType: 8 8 7 6 6 6 6 6 6 6 6 6 6 6 1 1 1 1 1 1 1 1 1 1 1 1 1 1
symmnumber: 1
zpe: 607207.2 jmol-1
zpe.correction: 0.231273 hartree
zpe.thermalcorrener: 0.243847 hartree
zpe.thermalcorrenthalpy: 0.244791 hartree
zpe.thermalcorrgfe: 0.193123 hartree
zpe.sumelectzpe: -631.485962 hartree
zpe.sumelectthermal: -631.473388 hartree
zpe.sumelectthermalent: -631.472444 hartree
zpe.sumelectthermalfe: -631.524112 hartree
dipole: -5.7316 1.8330 0.0699
dipole: 6.0180
quadrupole: -20.5655 -58.7516 -81.7581
quadrupole: 9.9317 -0.3930 0.6857
quadrupole: 33.1262 -5.0599 -28.0664 9.9317 -0.3930 0.6857
hfenergy: -631.7172352 hartree
pointgroup: C01 [X(C11H14N1O2)]
dipole: -2.2261403 0.7986182 0.1108661 debye
polarizability: 240.7927023|7.3707328|134.6363033|-11.4662642|-4.4699082|69.8469736 unknown
InChI: InChI=1S/C11H14NO2/c1-12-4-3-8-5-10(13)11(14-2)6-9(8)7-12/h5-7,13H,3-4H2,1-2H3
charge 1 multiplicity 1
28 atoms
O  2.823031 -1.638388 -0.192133
O  3.086283 1.281985 -0.397458
N  -3.111105 -0.509337 0.101037
C  -1.924272 1.645849 -0.425152
C  -3.062509 0.968303 0.359522
C  -0.620347 0.877869 -0.282052
C  -0.69062 -0.550551 -0.167217
C  -1.975208 -1.185383 -0.091483
C  0.642269 1.470439 -0.366862
C  0.496447 -1.3352 -0.158476
C  -4.433303 -1.16833 0.202128
C  1.773749 -0.744597 -0.229612
C  1.834257 0.691612 -0.330689
C  4.253924 -1.247464 -0.273038
H  -1.823144 2.684159 -0.065092
H  -2.195147 1.707631 -1.498693
H  -2.927282 1.100649 1.451544
H  -4.040779 1.392894 0.081083
H  -2.05454 -2.274905 -0.180917
H  0.728517 2.560189 -0.4691
H  0.455016 -2.426335 -0.078119
H  -4.324281 -2.2597 0.110115
H  -5.097717 -0.802637 -0.599534
H  -4.891502 -0.932963 1.178765
H  3.042431 2.269321 -0.46808
H  4.784428 -2.208412 -0.218563
H  4.532652 -0.601918 0.573944
H  4.468056 -0.740178 -1.226469
