program: Gaussian 09
title: 000183928
version: EM64L-G09RevD.01
frameworkgroup: C1[X(C16H12O5)]
method: RPBEPBE
basis: SDD
operation: Freq
keyword: #pfreq=noraman
keyword: PBEPBE/SDD
title: #p freq=noraman PBEPBE/SDD
converged: YES YES NO NO
title: Mulliken charges:
elementType: O O O O O C C C C C C C C C C C C C C C C H H H H H H H H H H H H
charge: -0.265391 -0.263259 -0.247331 -0.414252 -0.196316 0.188007 0.164826 0.181348 0.065976 0.179310 -0.489170 0.377169 -0.333753 -0.372062 -0.065056 -0.355166 -0.350574 -0.250978 -0.209580 -0.709501 0.165039 0.298781 0.265091 0.262712 0.251121 0.279876 0.263411 0.236580 0.236585 0.245139 0.243881 0.230831 0.386707
chargesum: 0.00000
title: Mulliken charges with hydrogens summed into heavy atoms:
elementType: O O O O O C C C C C C C C C C C C C C C C
charge: -0.265391 -0.263259 -0.247331 -0.027545 -0.196316 0.188007 0.164826 0.181348 0.065976 0.179310 -0.190389 0.377169 -0.068663 -0.109350 0.186065 -0.075290 -0.087163 -0.014398 0.027005 0.010350 0.165039
polarizability: 2.98398823e+02 1.64085112e+01 2.00247763e+02 -1.30060464e+01 1.26829907e+01 9.69062774e+01
1716.lowfreq: -7.1095 -0.0004 0.0006 0.0011 3.4015 5.4365 18.6559 30.4844 38.1519
frequency: 18.6036 30.4632 38.1470 60.7436 89.0007 110.7616 150.9862 164.3370 194.7215 218.8240 230.7240 256.6021 262.7363 279.1700 303.5089 344.1126 376.7108 408.7739 413.1144 439.5391 458.0894 491.5574 518.0952 526.7533 559.4007 570.6449 603.1128 609.0765 617.6010 638.8214 681.0970 695.3031 702.4680 721.1024 756.7889 770.0331 777.6274 805.0041 832.3577 837.9794 859.3795 882.2614 911.0108 918.3193 963.6065 973.6001 982.2399 1000.5272 1021.4492 1025.7297 1036.9599 1088.0141 1092.4292 1102.5395 1133.4072 1146.3367 1163.8547 1185.3562 1206.7660 1224.6185 1238.4288 1243.4772 1271.5004 1304.4687 1316.9605 1342.3753 1390.2098 1398.5687 1409.7394 1432.7395 1446.5668 1459.3117 1463.8992 1471.1877 1476.4552 1554.2286 1572.3436 1598.6465 1613.1198 1629.2343 1681.3063 3005.9703 3014.1074 3112.6427 3115.8977 3139.8346 3150.3835 3152.1539 3162.5475 3165.9872 3176.6011 3182.1638 3517.0967
redmass: 8.4550 6.6889 6.7398 8.5500 4.1252 4.4735 6.0911 5.8071 5.4912 1.1148 3.2798 4.7184 5.2865 6.1536 6.6248 6.8159 7.1683 5.4625 3.5914 6.6251 3.2322 5.3527 7.9573 3.7765 3.6737 4.1730 1.4576 5.6994 6.4753 5.8660 4.3232 6.3733 4.3209 3.9922 4.9985 1.4946 3.0780 2.7819 1.5178 5.4688 7.1944 1.4693 1.5778 3.0159 1.3377 1.3677 3.5604 1.3322 2.5846 1.9953 2.2784 2.2369 2.4952 1.7422 2.1850 1.5420 1.1585 2.3664 2.7061 2.2407 2.7062 1.8941 1.4640 2.0249 1.3980 1.5674 1.2179 10.3763 9.9785 4.7595 2.7238 2.8013 1.0560 2.8520 1.0537 9.6101 7.7426 8.6138 6.8414 7.3363 9.1073 1.0346 1.0849 1.1005 1.1015 1.0861 1.0914 1.0901 1.0883 1.0954 1.1000 1.0978 1.0643
irintensity: 1.9971 3.2104 0.4196 0.5673 1.5010 2.1500 0.0328 0.4530 3.8748 0.3935 0.6072 3.7972 1.7404 0.5795 5.4872 4.1311 0.2492 2.9333 1.2624 0.2564 0.0618 12.1883 3.3465 4.1540 16.8032 10.6275 116.7762 23.7197 35.8051 1.5313 3.4352 1.9281 39.9378 2.1822 20.4373 97.0579 15.1885 4.9291 52.1469 18.8694 10.7425 2.0268 17.4434 40.2698 0.1885 3.4131 28.4133 0.2185 287.1250 22.4555 29.6600 11.3544 51.4439 5.4065 2.8956 74.5715 5.9941 96.3159 125.6795 4.1482 18.9606 2.7482 24.8085 188.2280 4.4300 10.3946 19.6062 1.9106 56.5560 58.5479 315.9281 2.7433 14.2265 133.0943 13.7379 153.6784 44.3688 68.2553 9.2232 50.6632 185.4184 14.2083 11.4427 13.4568 14.3610 4.0812 13.0159 4.3907 1.3484 11.5363 19.8840 3.3423 30.4795
temp: 298.150 k
press: 1.00000 atm
elementType: 8 8 8 8 8 6 6 6 6 6 6 6 6 6 6 6 6 6 6 6 6 1 1 1 1 1 1 1 1 1 1 1 1
symmnumber: 1
zpe: 638166.2 jmol-1
zpe.correction: 0.243065 hartree
zpe.thermalcorrener: 0.260690 hartree
zpe.thermalcorrenthalpy: 0.261634 hartree
zpe.thermalcorrgfe: 0.195734 hartree
zpe.sumelectzpe: -991.561546 hartree
zpe.sumelectthermal: -991.543921 hartree
zpe.sumelectthermalent: -991.542977 hartree
zpe.sumelectthermalfe: -991.608877 hartree
dipole: -0.4644 0.8720 -0.8637
dipole: 1.3122
quadrupole: -90.5172 -113.5195 -127.2133
quadrupole: -5.4090 -7.4204 -3.4967
quadrupole: 19.8995 -3.1028 -16.7966 -5.4090 -7.4204 -3.4967
hfenergy: -991.804611 hartree
pointgroup: C01 [X(C16H12O5)]
dipole: -0.2073074 -0.3504052 0.3174564 debye
polarizability: 295.7891528|-22.4186727|200.6637654|16.9924617|16.8776471|99.0999444 unknown
InChI: InChI=1S/C16H12O5/c1-9(16(18)19)20-10-6-7-14-12(8-10)15(17)11-4-2-3-5-13(11)21-14/h2-9,18H,1H3
charge 0 multiplicity 1
33 atoms
O  -2.314554 -1.615709 -0.258049
O  3.253541 -1.387333 0.424305
O  -0.651876 2.130622 0.708189
O  4.061119 2.134582 0.027819
O  3.901919 0.52978 -1.655028
C  -0.329931 -0.224815 0.256869
C  -0.928211 -1.468502 -0.070725
C  -2.61241 0.797232 0.208097
C  -1.157357 0.997611 0.416134
C  -3.135679 -0.484836 -0.117681
C  1.079158 -0.160017 0.428229
C  1.856822 -1.318973 0.268475
C  -0.147784 -2.636912 -0.230214
C  1.239919 -2.560113 -0.061002
C  3.97201 -0.151216 0.747123
C  -3.522258 1.88323 0.328631
C  -4.518047 -0.693441 -0.319746
C  -4.898455 1.692406 0.13104
C  -5.39482 0.398738 -0.194171
C  5.41426 -0.565572 1.074451
C  3.955517 0.820474 -0.446652
H  1.492932 0.822602 0.678028
H  -0.639614 -3.579435 -0.485402
H  1.874847 -3.442402 -0.181801
H  3.505355 0.352393 1.615319
H  -3.103477 2.863392 0.579503
H  -4.8752 -1.696624 -0.569337
H  -5.591365 2.534445 0.225821
H  -6.468598 0.248268 -0.34911
H  5.869123 -1.076872 0.209779
H  5.410726 -1.256753 1.933338
H  6.017247 0.321688 1.331705
H  4.084339 2.772258 -0.736538
