program: Gaussian 09
title: 000183890
version: EM64L-G09RevD.01
frameworkgroup: C1[X(C7H14O2)]
method: RPBEPBE
basis: SDD
operation: Freq
keyword: #pfreq=noraman
keyword: PBEPBE/SDD
title: #p freq=noraman PBEPBE/SDD
converged: YES YES NO NO
title: Mulliken charges:
elementType: O O C C C C C C C H H H H H H H H H H H H H H
charge: -0.260119 -0.430930 0.295607 -0.367869 -0.364659 -0.411804 -0.452030 -0.377029 -0.695078 0.208863 0.209455 0.213312 0.192513 0.195100 0.212554 0.209578 0.229495 0.223493 0.195092 0.214607 0.209176 0.218318 0.332354
chargesum: 0.00000
title: Mulliken charges with hydrogens summed into heavy atoms:
elementType: O O C C C C C C C
charge: -0.260119 -0.098575 0.295607 0.050449 0.041166 -0.004151 -0.012958 0.041557 -0.052975
polarizability: 8.68452519e+01 4.02586897e-01 7.55904503e+01 -2.38339940e+00 -3.23429492e+00 7.54028910e+01
1716.lowfreq: -18.7418 -10.4789 -0.0009 -0.0008 -0.0006 5.6129 62.2475 63.6023 82.3387
frequency: 62.2280 63.4781 82.1306 126.4478 162.1974 215.1953 230.7040 287.9127 315.1590 339.0698 382.7400 389.1618 496.6082 698.1535 745.0349 798.1929 846.8564 878.1086 882.2106 919.3261 927.4603 938.2394 953.6905 978.0321 1018.6720 1054.5622 1071.1241 1082.9966 1092.4890 1117.7432 1162.5743 1207.3779 1239.8765 1270.9137 1277.0194 1296.7835 1307.1824 1322.0554 1338.5126 1357.5355 1375.7654 1389.0848 1453.8649 1464.8556 1472.1135 1475.7483 1478.3873 1485.2983 1490.3871 2958.1092 2963.0089 2967.0408 2970.4060 2973.6905 2988.7178 3013.3922 3036.2208 3039.2876 3052.3701 3070.7728 3074.0545 3075.5880 3557.2822
redmass: 2.5476 3.1085 2.7057 2.7916 2.4867 2.7856 1.1505 1.3707 2.3196 1.9503 2.4064 2.6376 3.0574 2.7622 1.2090 4.1683 1.5522 2.7694 1.8099 2.0753 5.1598 1.8990 1.4870 4.0374 2.0062 2.1153 2.1012 1.2085 1.0503 1.7931 2.2507 1.7187 1.4931 1.2471 1.5672 1.3798 1.3008 1.3544 1.4366 1.5908 1.2473 1.2121 1.0787 1.0802 1.0694 1.0605 1.0522 1.0751 1.1009 1.0679 1.0615 1.0582 1.0612 1.0368 1.0582 1.0953 1.1027 1.1061 1.1106 1.1007 1.0990 1.0952 1.0660
irintensity: 2.0203 2.9196 7.0246 6.3249 3.1065 0.4479 0.0383 76.3328 8.8169 40.4964 16.9899 28.9272 0.4235 2.3992 11.6646 20.1511 1.8449 2.1867 2.3899 14.8488 39.1646 16.0081 0.6823 85.7994 4.6057 2.2809 4.1834 0.0283 0.0715 7.2690 6.9050 7.7831 2.5332 4.7581 2.7912 1.9134 1.1566 5.7758 4.8603 2.4282 16.4502 10.3807 4.4046 6.7979 6.5531 2.1317 12.4385 12.1216 3.7412 45.7374 23.2903 55.2162 90.0883 38.0081 33.5682 4.3719 20.7328 35.4838 62.9505 76.2699 25.2625 50.4918 4.7011
temp: 298.150 k
press: 1.00000 atm
elementType: 8 8 6 6 6 6 6 6 6 1 1 1 1 1 1 1 1 1 1 1 1 1 1
symmnumber: 1
zpe: 524928.6 jmol-1
zpe.correction: 0.199935 hartree
zpe.thermalcorrener: 0.210644 hartree
zpe.thermalcorrenthalpy: 0.211588 hartree
zpe.thermalcorrgfe: 0.163386 hartree
zpe.sumelectzpe: -424.783370 hartree
zpe.sumelectthermal: -424.772661 hartree
zpe.sumelectthermalent: -424.771717 hartree
zpe.sumelectthermalfe: -424.819919 hartree
dipole: -0.8754 0.2182 -0.3163
dipole: 0.9561
quadrupole: -61.0445 -64.3805 -51.9505
quadrupole: 8.4617 -1.7044 -2.6900
quadrupole: -1.9193 -5.2553 7.1746 8.4617 -1.7044 -2.6900
hfenergy: -424.9833045 hartree
pointgroup: C01 [X(C7H14O2)]
dipole: -0.3512022 -0.0617685 0.1196824 debye
dipolederiv: -0.4610531 0.0054072 -0.0618237 -0.0402034 -0.4357295 0.1155871 -0.0949427 0.1161035 -0.5564284 -0.2826578 0.053945 0.1917813 0.041881 -0.873681 0.0739439 0.2285444 0.1032631 -0.4076353 0.0868017 -0.0106789 -0.0125247 -0.0295506 -0.05832 0.0448352 -0.0799336 0.0089266 -0.032328 0.2749103 -0.1492115 0.1642623 -0.0849745 0.1722368 0.0401225 0.074985 -0.0584447 0.4329498 0.1128828 -0.042752 -0.1197634 -0.1013478 0.355974 -0.1459021 0.0250406 -0.102064 0.4001022 0.0093262 0.0115725 -0.0134833 0.0428929 0.1025997 -0.010724 0.0006777 -0.0121853 0.0453958 0.2598112 -0.004071 -0.0632157 0.0501008 0.6118507 -0.1199555 -0.0625789 -0.1191989 0.3492262 0.0184762 0.0260023 -0.0025067 0.0395684 0.1534879 -0.0368002 0.0210456 -0.0200105 0.0762683 -0.0378131 0.0299258 0.0282403 0.0303677 0.0854112 -0.0053153 -0.0033992 -0.0083351 0.0666677 0.0128709 0.0039608 0.0473292 0.0152459 0.0716713 -0.0772785 0.0344229 -0.0131769 -0.1917014 -0.0456548 0.1252338 -0.0606452 0.1189769 -0.1226298 0.0314579 -0.0220531 -0.0143405 0.034058 0.0502365 0.001215 0.0990681 0.0013028 0.0013306 -0.0732477 0.0445396 -0.0333315 -0.1766385 -0.0606701 0.1160233 -0.0367248 0.1390665 -0.1497599 0.0928661 -0.003751 0.039462 0.0332055 0.0211021 -0.001462 -0.0152366 0.0018394 -0.1127134 -0.1274346 -0.0190222 -0.0977943 -0.0113517 0.0227522 -0.0337664 0.0213085 -0.0484708 -0.0050717 0.131701 0.0152494 0.1015749 -0.0392584 -0.178551 0.0277765 0.1406516 0.0177087 -0.0196832 0.0254557 0.0758777 0.025317 0.0082382 0.0123182 -0.0335339 -0.1321227 -0.043998 0.0334172 0.0229689 -0.1016536 0.0308541 -0.0506973 0.0484898 0.0006987 -0.0039558 -0.0100769 -0.1092973 -0.1167802 -0.0058633 -0.0961865 0.002833 0.0090973 -0.0515786 0.0767852 -0.0396332 -0.0267337 0.1297517 0.0582541 0.1043137 -0.0814794 0.0561684 -0.0140367 0.0395068 -0.0561273 -0.0251527 0.1276877 0.0948243 0.1065068 -0.0494301 0.06479 -0.0492042 -0.0156793 0.0119916 -0.1300035 -0.1092257 0.0272116 -0.1085632 0.034211 -0.1267422 0.0293607 -0.1105095 0.0269949 0.0942833 0.002578 -0.1538222 0.0123499 -0.0278587 0.1331081 -0.0408266 -0.160742 -0.0835549 0.386513 -0.016292 -0.1536528 0.0349595 0.1416514 unknown
polarizability: 86.6733201|-1.3301555|75.9342203|2.1730493|-3.4097025|75.2310528 unknown
InChI: InChI=1S/C7H14O2/c1-2-3-7(4-8)5-9-6-7/h8H,2-6H2,1H3
charge 0 multiplicity 1
23 atoms
O  2.319413 1.235415 0.117185
O  0.185957 -2.525769 0.066525
C  0.511085 -0.035204 0.009195
C  1.130326 1.143735 -0.813135
C  1.70741 0.172996 0.999404
C  -0.882869 0.234392 0.613412
C  0.590346 -1.372938 -0.753988
C  -2.024523 0.331489 -0.425699
C  -3.361221 0.762917 0.214795
H  1.453428 0.913173 -1.845838
H  0.541109 2.079331 -0.799941
H  1.432048 0.585853 1.98776
H  2.403063 -0.680468 1.12686
H  -0.837911 1.179613 1.19322
H  -1.123215 -0.574104 1.332652
H  1.618154 -1.513703 -1.153143
H  -0.114621 -1.384784 -1.601818
H  -2.158586 -0.648938 -0.92157
H  -1.746659 1.055555 -1.22016
H  -3.672776 0.04641 0.997923
H  -3.273134 1.759385 0.687393
H  -4.170688 0.814554 -0.536019
H  0.827665 -2.628808 0.814288
