program: Gaussian 09
title: 000183922
version: EM64L-G09RevD.01
frameworkgroup: C1[X(C15H20O3)]
method: RPBEPBE
basis: SDD
operation: Freq
keyword: #pfreq=noraman
keyword: PBEPBE/SDD
title: #p freq=noraman PBEPBE/SDD
converged: YES YES NO NO
title: Mulliken charges:
elementType: O O O C C C C C C C C C C C C C C C H H H H H H H H H H H H H H H H H H H H
charge: -0.232734 -0.188980 -0.209705 0.243221 -0.073564 -0.055154 -0.545038 -0.683319 -0.215409 -0.479708 0.368817 0.138084 -0.519451 -0.795643 -0.762950 -0.008611 0.099736 -0.776689 0.218070 0.216675 0.273379 0.241349 0.231409 0.234695 0.262444 0.227334 0.223142 0.254623 0.220506 0.231985 0.225812 0.255604 0.219137 0.224812 0.215885 0.214937 0.252698 0.252602
chargesum: 0.00000
title: Mulliken charges with hydrogens summed into heavy atoms:
elementType: O O O C C C C C C C C C C C C C C C
charge: -0.232734 -0.188980 -0.209705 0.243221 0.144506 0.161521 -0.030311 -0.217216 0.047036 -0.029231 0.368817 0.138084 -0.044322 -0.082242 -0.103117 -0.008611 0.099736 -0.056452
polarizability: 2.06633180e+02 -4.74461909e+00 1.59366926e+02 1.07872630e+01 -1.81250999e+00 1.24243261e+02
1716.lowfreq: -11.5295 -3.5348 -0.0010 -0.0009 -0.0009 10.6535 52.4928 55.9377 60.1888
frequency: 52.3156 55.9213 59.6021 79.0394 112.7892 142.5973 161.9625 191.7983 198.3858 208.2698 228.4622 244.4604 262.8039 285.3726 294.1721 307.5299 318.2886 356.1440 394.3784 401.9295 426.0878 446.5061 501.5798 521.4137 537.6838 569.3652 577.7712 634.4132 667.4430 682.8799 698.3004 709.5491 728.9584 796.6677 810.7807 842.2778 861.0147 895.6000 920.5520 942.2263 952.1067 966.4062 971.1564 993.1769 1009.9770 1018.1838 1033.9290 1038.9699 1049.1787 1055.9407 1100.0041 1107.1871 1121.7183 1126.1448 1146.8613 1152.7477 1175.2101 1198.3442 1209.4032 1240.5262 1244.6380 1259.0978 1270.0221 1286.9966 1298.9954 1305.5555 1316.7430 1321.8888 1329.6309 1334.6423 1340.1076 1347.7462 1385.7322 1396.8468 1403.5467 1444.3481 1455.9610 1457.9761 1466.4526 1467.7431 1473.6361 1474.6819 1484.4529 1486.2889 1491.5956 1621.8174 1680.3581 1696.9942 2943.5394 2966.6824 2972.1835 2973.2593 2974.9757 2986.3371 2990.3605 2997.7010 3000.2569 3009.7680 3047.2272 3053.3781 3066.2294 3066.4717 3070.4101 3076.4308 3083.1245 3085.1457 3091.5573 3094.1026
redmass: 3.8401 4.4968 3.2860 1.1290 3.4342 3.2170 2.4039 4.6717 2.2188 1.2475 1.5845 1.8415 3.5774 3.9179 2.9049 4.6949 2.6597 3.4908 2.9335 2.4818 3.3169 3.1285 3.4587 3.7571 2.6987 5.1586 3.4669 4.4580 5.5997 3.8576 3.7552 3.8411 3.9495 2.4084 2.6370 2.4600 2.1578 1.7963 1.6886 4.2390 1.8536 2.0956 2.1808 2.3545 1.7515 2.5330 2.3171 1.6070 2.2799 2.2127 1.8151 2.1451 2.2269 1.9054 1.7540 2.2545 2.5155 1.5513 1.8901 2.1868 1.5138 1.5032 1.4285 1.6570 1.3704 1.4716 1.3812 1.3967 1.3623 1.5921 2.2461 1.4554 1.1872 1.2024 1.2893 1.0820 1.0476 1.0839 1.0833 1.0617 1.0581 1.0645 1.0569 1.0517 1.0664 10.6235 9.9506 10.8485 1.0805 1.0733 1.0673 1.0439 1.0671 1.0367 1.0366 1.0631 1.0697 1.0756 1.1021 1.0946 1.0971 1.0980 1.0951 1.0987 1.0989 1.1000 1.0999 1.0997
irintensity: 0.2397 1.3402 2.8924 1.5091 2.5078 2.1847 0.6873 0.9778 0.0624 0.8218 0.9274 0.1689 4.3491 0.7323 0.2457 1.6502 2.8964 0.8216 2.0712 0.3036 5.6317 0.8491 0.6547 11.9961 0.3103 12.2441 0.8119 3.8275 0.2925 7.1588 5.6806 5.9270 2.3218 5.1560 12.2819 9.1267 23.5192 10.0545 4.4751 60.9215 1.0279 5.8877 8.1455 45.1877 18.3500 20.2478 14.4178 2.0081 1.2482 40.1510 2.3589 4.6238 5.7410 9.9059 3.4877 9.7789 3.9900 8.6327 5.7977 4.1532 36.9724 7.8283 8.2392 4.6918 0.5133 14.6182 2.6077 1.9246 2.7666 0.6920 0.5964 2.8464 27.6546 17.1085 20.0551 23.9595 7.0481 11.0695 6.5271 7.6021 7.7141 1.0403 23.2699 4.1921 19.1099 138.2845 383.9051 123.4896 3.3443 3.2987 1.9342 23.4152 44.7995 17.7837 15.9861 49.3954 2.4637 29.4929 20.8356 34.8579 4.9097 54.9885 17.2699 42.8914 35.1250 11.1480 15.8370 16.4000
temp: 298.150 k
press: 1.00000 atm
elementType: 8 8 8 6 6 6 6 6 6 6 6 6 6 6 6 6 6 6 1 1 1 1 1 1 1 1 1 1 1 1 1 1 1 1 1 1 1 1
symmnumber: 1
zpe: 836716.7 jmol-1
zpe.correction: 0.318689 hartree
zpe.thermalcorrener: 0.336028 hartree
zpe.thermalcorrenthalpy: 0.336972 hartree
zpe.thermalcorrgfe: 0.274363 hartree
zpe.sumelectzpe: -807.905149 hartree
zpe.sumelectthermal: -807.887809 hartree
zpe.sumelectthermalent: -807.886865 hartree
zpe.sumelectthermalfe: -807.949474 hartree
dipole: 5.3747 5.8268 2.2902
dipole: 8.2513
quadrupole: -131.8753 -116.1024 -104.5283
quadrupole: -2.8850 -4.0873 -5.5476
quadrupole: -14.3733 1.3996 12.9737 -2.8850 -4.0873 -5.5476
hfenergy: -808.2238374 hartree
pointgroup: C01 [X(C15H20O3)]
dipole: 2.103016 2.3232321 0.8476535 debye
polarizability: 206.3798601|-4.3043792|159.1981677|11.8800655|-3.0267151|124.6653393 unknown
InChI: InChI=1S/C15H20O3/c1-8-4-5-13(16)15(3)7-12-10(6-11(8)15)9(2)14(17)18-12/h8,11-12H,4-7H2,1-3H3
charge 0 multiplicity 1
38 atoms
O  -2.64716 -1.516778 0.113504
O  2.457764 -2.590148 -0.67614
O  -4.573261 -0.553162 -0.818742
C  1.147796 -0.778212 0.334337
C  0.986003 0.754332 0.04684
C  2.278749 1.588757 0.322822
C  -0.153728 -1.543164 -0.080035
C  -0.252235 1.344595 0.800894
C  -1.377561 -0.982341 0.667651
C  3.573186 0.804745 -0.081945
C  -1.471189 0.521543 0.497382
C  2.316833 -1.349545 -0.513525
C  3.294378 -0.335187 -1.093203
C  1.504258 -1.082642 1.824645
C  2.226963 2.950328 -0.414304
C  -2.667884 0.850968 -0.073564
C  -3.444253 -0.403461 -0.317426
C  -3.232097 2.18674 -0.468758
H  0.761818 0.843817 -1.039311
H  2.325465 1.793232 1.412538
H  -0.029113 -2.621194 0.115658
H  -0.328683 -1.422952 -1.166706
H  -0.411031 2.397617 0.509922
H  -0.040012 1.343798 1.88997
H  -1.358927 -1.279548 1.733641
H  4.059045 0.370695 0.812047
H  4.305951 1.506775 -0.521002
H  4.216875 -0.862983 -1.3910
H  2.850306 0.087618 -2.019286
H  2.454623 -0.608346 2.125241
H  0.722143 -0.722494 2.515109
H  1.610383 -2.172696 1.962123
H  1.315972 3.527261 -0.173387
H  3.096162 3.57582 -0.140844
H  2.251505 2.803044 -1.51155
H  -2.514678 3.006341 -0.293867
H  -4.152359 2.402111 0.105146
H  -3.521207 2.188715 -1.53527
