program: Gaussian 09
title: 000183898
version: EM64L-G09RevD.01
frameworkgroup: C1[X(C17H17NO3)]
method: RPBEPBE
basis: SDD
operation: Freq
keyword: #p
keyword: freq=noraman
keyword: PBEPBE/SDD
title: #p freq=noraman PBEPBE/SDD
converged: YES YES NO NO
title: Mulliken charges:
elementType: O O O N C C C C C C C C C C C C C C C C C H H H H H H H H H H H H H H H H H
charge: -0.229234 -0.256992 -0.282126 -0.411226 0.167587 0.219425 0.185410 0.192393 0.083419 0.083664 -0.606067 -0.378408 -0.037329 -0.337720 -0.321747 -0.343790 -0.201151 0.346699 -0.786342 -0.788637 -0.522876 0.359493 0.221793 0.283253 0.261263 0.245932 0.261489 0.254006 0.269437 0.216762 0.232340 0.223552 0.234212 0.233327 0.217599 0.249749 0.230433 0.230407
chargesum: 0.00000
title: Mulliken charges with hydrogens summed into heavy atoms:
elementType: O O O N C C C C C C C C C C C C C C C C C
charge: -0.229234 -0.256992 -0.282126 -0.051733 0.167587 0.219425 0.185410 0.192393 0.083419 0.083664 -0.101020 -0.117146 -0.037329 -0.091787 -0.060258 -0.089784 0.068286 0.346699 -0.113688 -0.103499 0.187713
polarizability: 2.79825213e+02 3.52551849e+01 2.97131491e+02 -6.40685416e+00 4.56073846e+00 1.08637394e+02
1716.lowfreq: -7.6535 -5.5522 -0.0004 0.0005 0.0009 4.5442 27.9585 33.5975 51.8717
frequency: 27.6645 33.5836 51.8577 69.1447 76.3772 106.0387 120.5181 134.3849 156.3340 170.2107 177.5068 208.5374 235.8929 254.7886 259.3307 280.3198 293.5537 297.0742 326.4363 345.8696 366.7073 383.3971 411.5060 451.0267 467.4200 505.1632 515.1059 541.4941 563.7216 591.1287 598.7256 607.4018 629.5096 679.3054 718.5669 725.1890 748.3787 770.7964 779.7793 781.6149 819.1504 842.9426 845.4190 862.4229 874.4346 904.9972 940.3385 947.4842 976.1485 985.5967 995.6140 1003.4358 1026.2905 1039.8625 1066.2262 1079.1057 1112.6481 1112.9260 1138.3820 1148.0419 1165.5458 1178.3192 1192.3464 1224.1912 1229.7256 1267.7295 1278.0794 1306.5367 1332.3803 1349.3792 1355.5667 1389.3232 1398.8235 1412.8441 1429.8485 1453.7843 1455.5596 1458.4202 1465.7582 1468.7369 1472.9691 1473.3202 1475.3906 1476.4840 1495.1012 1521.3140 1536.9140 1572.4371 1604.2052 1648.9439 1669.8384 2953.3641 2959.9834 2966.4791 2981.0954 3004.7552 3031.6514 3036.1561 3077.8347 3082.3704 3083.9817 3091.2105 3133.3061 3145.8347 3172.5513 3249.0012 3285.5388 3311.2714
redmass: 2.9574 4.0809 3.1115 3.4195 6.8637 4.4552 1.0632 4.1296 2.0308 2.8571 2.1233 4.1352 3.9447 1.1828 4.0189 4.2087 4.9506 2.4060 5.4215 4.6535 7.4476 2.9938 3.6080 2.8031 3.5529 7.0654 4.1591 4.6731 3.9739 5.3795 5.0799 4.7888 3.7861 1.4621 3.3717 3.3524 4.0379 3.5521 2.5082 2.4827 4.1503 1.3812 1.6790 3.6885 2.2048 2.4173 4.3087 1.3828 4.1155 1.3058 1.7960 1.8255 2.1707 3.1774 3.0946 1.6535 1.3013 2.0321 1.4661 1.4111 1.5367 1.5325 2.8728 2.1340 1.8901 2.4818 1.9841 2.2672 3.1195 1.8718 1.6541 1.2756 1.2400 2.2181 5.8076 1.2189 1.0608 1.4402 2.0104 1.1940 1.0474 1.0700 1.0841 1.1343 5.1182 7.4212 6.3029 4.8402 8.5870 7.9162 6.0581 1.0601 1.0378 1.0385 1.0316 1.0963 1.0970 1.0965 1.0930 1.1054 1.0942 1.0964 1.1009 1.0870 1.0974 1.0916 1.1075 1.0805
irintensity: 0.1331 1.3335 2.4362 0.9519 0.6379 4.4651 0.4680 6.4519 5.4810 0.5134 1.0596 0.7254 1.8886 0.0548 6.5749 3.5698 1.7850 2.3748 7.6745 1.5872 8.1809 4.8199 5.3881 13.2463 4.2805 26.7308 2.4204 4.2990 6.2299 7.1197 10.4023 6.9654 0.4709 88.1508 10.4331 28.7203 10.8874 4.8983 8.4389 22.5141 1.2683 0.0488 44.3287 4.6826 21.8664 23.8302 23.2156 0.6752 7.9693 0.1139 12.7102 2.4154 23.8766 24.2677 75.0066 5.5857 3.8327 32.6041 19.0067 35.4085 23.5893 7.0154 50.5824 46.5894 0.9812 40.4837 10.9432 58.5911 54.0348 79.2958 59.9996 27.2011 11.8712 167.9718 16.0572 59.1395 0.1599 84.7664 94.6017 34.1850 31.5316 16.7432 11.1538 41.1023 125.2216 34.6878 60.3199 71.5961 14.7246 481.6741 1.7549 51.3308 31.8065 49.1686 61.2717 14.2118 8.5017 31.1596 5.8470 31.6189 40.5715 32.1526 19.4048 3.4770 15.2147 8.6826 3.4207 541.3018
temp: 298.150 k
press: 1.00000 atm
elementType: 8 8 8 7 6 6 6 6 6 6 6 6 6 6 6 6 6 6 6 6 6 1 1 1 1 1 1 1 1 1 1 1 1 1 1 1 1 1
symmnumber: 1
zpe: 786598.7 jmol-1
zpe.correction: 0.299600 hartree
zpe.thermalcorrener: 0.319263 hartree
zpe.thermalcorrenthalpy: 0.320207 hartree
zpe.thermalcorrgfe: 0.250974 hartree
zpe.sumelectzpe: -936.878358 hartree
zpe.sumelectthermal: -936.858695 hartree
zpe.sumelectthermalent: -936.857750 hartree
zpe.sumelectthermalfe: -936.926983 hartree
dipole: -5.5305 -8.3463 0.0989
dipole: 10.0128
quadrupole: -96.9322 -137.8044 -125.0056
quadrupole: -9.7593 -1.4054 0.7760
quadrupole: 22.9819 -17.8903 -5.0915 -9.7593 -1.4054 0.7760
hfenergy: -937.1779577 hartree
pointgroup: C01 [X(C17H17N1O3)]
dipole: 2.7069004 -2.7004415 -0.9479946 debye
polarizability: 287.2621176|-30.044008|278.5324907|-38.9684384|29.2126243|119.7994894 unknown
InChI: InChI=1S/C17H17NO3/c1-10(2)4-5-11-14(19)7-6-12-15(11)18-17-13(8-9-21-17)16(12)20-3/h4,6-9,18H,5H2,1-3H3
charge 0 multiplicity 1
38 atoms
O  1.035133 -2.673965 -0.65755
O  3.231186 1.625672 -0.603982
O  -2.710321 3.338332 0.878697
N  -0.260454 -0.725999 -0.144489
C  -0.327523 0.683432 0.042605
C  0.911716 1.439794 -0.141205
C  -1.541533 1.279141 0.391207
C  2.12995 0.790693 -0.466248
C  2.153707 -0.641257 -0.627907
C  0.918724 -1.306492 -0.460977
C  -2.816935 0.489167 0.666424
C  0.833749 2.871403 0.033766
C  -1.61003 2.736915 0.562163
C  -0.3578 3.485467 0.359549
C  3.106212 -1.701399 -0.951656
C  -3.192516 -0.530282 -0.394934
C  2.418121 -2.893209 -0.963903
C  -3.539258 -1.844761 -0.224567
C  -3.946751 -2.701849 -1.413454
C  -3.598778 -2.554384 1.118748
C  4.552805 1.079121 -0.933025
H  -1.15543 -1.244218 -0.167628
H  -2.75808 0.014783 1.666578
H  -3.614105 1.258079 0.746408
H  1.750608 3.452259 -0.099771
H  -0.419236 4.571504 0.490131
H  4.168972 -1.610321 -1.153402
H  -3.21333 -0.127088 -1.419616
H  2.68524 -3.92807 -1.149369
H  -3.301608 -3.598315 -1.504626
H  -3.895177 -2.140517 -2.362316
H  -4.984343 -3.071941 -1.292708
H  -3.189871 -1.954638 1.948232
H  -4.648596 -2.80036 1.374364
H  -3.051134 -3.516637 1.082784
H  5.213653 1.956861 -0.972921
H  4.542099 0.578529 -1.917867
H  4.903733 0.386849 -0.146729
