program: Gaussian 09
title: 000183888
version: EM64L-G09RevD.01
frameworkgroup: C1[X(C10H12O3)]
method: RPBEPBE
basis: SDD
operation: Freq
keyword: #pfreq=noraman
keyword: PBEPBE/SDD
title: #p freq=noraman PBEPBE/SDD
converged: YES YES NO NO
title: Mulliken charges:
elementType: O O O C C C C C C C C C C H H H H H H H H H H H H
charge: -0.287087 -0.274541 -0.269687 0.029029 0.415833 0.198616 0.155058 -0.472015 -0.388045 -0.301060 -0.693422 -0.693346 -0.199410 0.195407 0.261747 0.252835 0.250031 0.225403 0.203473 0.235204 0.228490 0.212094 0.247538 0.234275 0.233581
chargesum: 0.00000
title: Mulliken charges with hydrogens summed into heavy atoms:
elementType: O O O C C C C C C C C C C
charge: -0.287087 -0.274541 -0.269687 0.224436 0.415833 0.198616 0.155058 -0.210268 -0.135210 -0.051030 -0.029342 -0.005224 0.268446
polarizability: 1.70740359e+02 4.68413723e+00 1.15267042e+02 -1.26565781e+00 4.32983272e+00 6.98753828e+01
1716.lowfreq: -78.6001 -10.6612 -5.9998 -0.0009 -0.0007 -0.0003 3.4619 46.2299 73.5216
frequency: -78.5978 46.1777 73.4984 121.3097 155.4295 178.8497 223.1044 225.5594 275.3959 306.6495 325.7497 384.1335 421.8200 424.2656 471.6404 533.0345 589.0677 597.1437 675.8554 703.0946 726.4009 779.8818 803.5171 818.4246 833.6716 845.6898 893.6820 922.7514 925.0386 937.7654 944.9378 980.9935 1048.3825 1065.4854 1106.9078 1119.2020 1124.7976 1147.6778 1161.8757 1183.8877 1257.8386 1272.9382 1319.5911 1342.1034 1364.9870 1379.1386 1383.0321 1396.6367 1441.9435 1455.1610 1466.7988 1468.3882 1471.0090 1487.8586 1488.5479 1607.4435 1636.8832 2969.0318 2987.4069 2993.7837 3005.8061 3081.6726 3083.4896 3092.4427 3095.1139 3102.6293 3166.4926 3186.2857 3191.1481
redmass: 2.3838 4.1890 2.9231 3.4921 7.0639 1.0330 5.5525 1.1308 3.4252 3.9310 6.3853 3.3025 2.9720 3.1892 3.3550 5.3621 5.6625 4.1693 9.2377 3.9093 5.6053 6.6131 1.3905 3.8367 1.5861 7.7130 3.1102 1.3190 1.2739 1.7684 2.1476 4.9894 3.4798 1.4593 1.7410 1.0364 1.3286 2.1001 2.1547 2.1043 1.6269 3.4973 1.3000 1.4143 1.3215 1.2595 3.8756 1.2884 4.6482 1.0526 1.2397 1.0807 1.7236 1.1869 1.0900 7.9244 8.9254 1.0844 1.0357 1.0360 1.0534 1.1188 1.0992 1.1002 1.0997 1.1003 1.0885 1.0967 1.0924
irintensity: 13.5481 1.9652 0.2133 1.0516 0.4590 0.1088 0.1819 0.0334 1.9807 0.9793 2.4793 4.5663 4.2331 2.3848 2.4887 0.3480 4.4986 6.1358 0.1271 1.5420 4.1903 19.8379 36.0551 35.8767 49.4933 16.3704 7.8164 0.1964 3.5223 17.2576 20.6862 188.7704 18.5007 4.3645 71.5644 0.0766 40.0594 55.1027 204.8512 116.0376 28.9916 55.7924 27.5958 13.6614 0.5007 30.8303 6.5946 24.9184 13.1838 5.4700 73.3401 13.8768 242.0943 23.6790 16.3035 35.5203 30.4854 31.4268 16.3909 26.6485 131.0306 37.2205 14.8009 28.3923 37.8210 35.5549 4.1763 5.1570 1.7907
temp: 298.150 k
press: 1.00000 atm
elementType: 8 8 8 6 6 6 6 6 6 6 6 6 6 1 1 1 1 1 1 1 1 1 1 1 1
symmnumber: 1
zpe: 522160.1 jmol-1
zpe.correction: 0.198880 hartree
zpe.thermalcorrener: 0.210543 hartree
zpe.thermalcorrenthalpy: 0.211487 hartree
zpe.thermalcorrgfe: 0.160930 hartree
zpe.sumelectzpe: -612.922029 hartree
zpe.sumelectthermal: -612.910366 hartree
zpe.sumelectthermalent: -612.909421 hartree
zpe.sumelectthermalfe: -612.959979 hartree
dipole: 0.8546 -1.5892 -0.0816
dipole: 1.8063
quadrupole: -66.0864 -75.0369 -78.2057
quadrupole: -0.3206 0.1675 0.6831
quadrupole: 7.0233 -1.9272 -5.0960 -0.3206 0.1675 0.6831
hfenergy: -613.1209088 hartree
pointgroup: C01 [X(C10H12O3)]
dipole: -0.3406003 -0.6023622 0.1617193 debye
dipolederiv: -1.9242044 -0.297909 0.2111891 -0.254901 -0.3895447 -0.0183359 0.3299762 0.0178933 -0.3533541 -1.1246356 0.379453 -0.032891 0.530195 -0.7223269 0.0986896 -0.0658279 0.10314 -0.2778833 -1.3180022 0.3292862 0.0061334 0.3763947 -0.5380421 0.057866 0.0136619 0.0540386 -0.2640231 0.9208841 0.2084322 -0.0781251 0.6006766 0.4892381 -0.0261197 -0.22136 0.0194608 0.4451163 1.6258943 0.131933 -0.1484787 -0.0149799 0.044324 0.000611 -0.2149982 -0.0206098 0.1075915 0.5187379 -0.1848856 0.0062617 -0.8831662 0.688727 -0.1197639 0.2221115 -0.1804606 0.0834356 1.061527 -0.3918616 0.0041893 0.1270686 -0.2381774 0.068754 -0.178455 0.1306962 -0.0286891 -0.3736769 0.0115574 0.0181623 0.2401429 -0.0824967 -0.0472855 -0.0539367 -0.0441167 -0.194086 -0.4486213 0.1021195 -0.0248112 -0.3112733 -0.0499976 -0.0251156 0.1145068 -0.0605832 -0.2045597 0.1408315 -0.1282147 0.0125661 0.0160011 0.1220722 -0.0925189 -0.0402528 -0.0727299 -0.1155151 -0.1232046 0.0282867 0.0534678 0.0025119 0.0190846 -0.0568399 0.0672911 -0.0460261 0.0209644 -0.0798651 0.0053124 0.0126285 -0.1348751 -0.0736386 -0.0908956 0.0235379 -0.1492357 -0.1045332 1.0871386 -0.2696424 0.0435233 -0.3226891 0.6847876 -0.0055517 0.0587617 -0.0088284 0.5787337 -0.0620443 0.0557476 -0.1032172 -0.0528058 -0.0480748 0.078381 -0.0472378 0.060709 -0.1024502 0.0843611 -0.0615792 0.0329044 -0.0840792 0.01192 0.054128 0.0468356 0.0602001 0.1534606 0.0488447 0.0835019 -0.0104901 0.0725883 0.0092884 0.0458756 -0.0043781 0.0441712 0.1630106 0.0489771 -0.0703029 0.0371111 -0.0654373 0.0125822 0.0606356 0.0368358 0.0617441 0.1514881 0.0536507 0.0414564 -0.038439 0.0882407 0.0435556 0.0630231 -0.10068 0.0994985 -0.0432762 -0.0564926 -0.0864454 0.0529687 -0.1342853 -0.0459404 0.0636125 0.0562826 0.0414988 0.086707 0.0992802 -0.0189781 -0.0378847 0.0200629 0.0056868 -0.1308939 -0.0195086 -0.1169305 -0.0528208 0.0413467 0.0297383 -0.0890014 0.091485 0.0301712 0.0942697 -0.0803747 0.0402527 -0.0259549 -0.0153354 -0.125877 0.0285053 -0.1669886 -0.0547414 0.0411485 0.022986 0.0594571 0.0635093 -0.0526919 0.0946878 0.0904851 0.1126302 0.0689315 -0.0408615 0.0919615 -0.0253228 0.0441103 -0.0529363 0.0775347 0.0347163 0.1193597 -0.0310073 -0.0670651 0.1190837 -0.1132247 -0.0454904 -0.0997631 0.0566489 -0.0814741 0.0281231 0.0436187 -0.0057474 -0.1768226 0.045308 -0.0854914 unknown
polarizability: 169.7844873|-7.1639956|112.8788315|-8.1060382|-11.0081121|73.2194652 unknown
InChI: InChI=1S/C10H12O3/c1-7(2)13-8-3-4-9-10(5-8)12-6-11-9/h3-5,7H,6H2,1-2H3
charge 0 multiplicity 1
25 atoms
O  -2.168596 0.805377 0.215694
O  2.197092 -1.626644 0.442537
O  3.391565 0.313536 -0.33554
C  -3.017026 -0.353217 0.611916
C  -0.780988 0.63375 0.072508
C  1.300404 -0.553005 0.207555
C  1.995648 0.582164 -0.24655
C  -0.086441 -0.575244 0.38065
C  -0.083956 1.78116 -0.387343
C  1.324182 1.769213 -0.55325
C  -4.323457 0.270895 1.112836
C  -3.223794 -1.299565 -0.584666
C  3.550088 -1.090288 0.120607
H  -2.517453 -0.885184 1.448784
H  -0.586029 -1.478205 0.735874
H  -0.662889 2.682148 -0.606944
H  1.860498 2.65322 -0.906764
H  -4.802005 0.853451 0.306149
H  -5.023997 -0.518362 1.4404
H  -4.130436 0.947927 1.962116
H  -3.741736 -0.765503 -1.400715
H  -3.843414 -2.164844 -0.285063
H  -2.26574 -1.681252 -0.977115
H  3.98436 -1.690146 -0.69803
H  4.165821 -1.106582 1.037355
