program: Gaussian 09
title: 000183903
version: EM64L-G09RevD.01
frameworkgroup: C1[X(C18H21N5)]
method: RPBEPBE
basis: SDD
operation: Freq
keyword: #pfreq=noraman
keyword: PBEPBE/SDD
title: #p freq=noraman PBEPBE/SDD
converged: YES YES NO NO
title: Mulliken charges:
elementType: N N N N N C C C C C C C C C C C C C C C C C C H H H H H H H H H H H H H H H H H H H H H
charge: -0.190936 -0.063673 -0.483157 -0.061874 -0.690740 -0.385272 -0.376707 -0.386842 -0.369863 0.516995 -0.615300 -0.563817 0.336575 -0.399432 -0.042028 -0.350938 0.054333 0.388874 -0.381586 -0.359370 -0.420276 -0.436524 0.494737 0.215993 0.203247 0.215002 0.209432 0.209181 0.187714 0.187767 0.208718 0.188419 0.223037 0.224238 0.242938 0.218654 0.241934 0.301524 0.274948 0.189459 0.217390 0.214630 0.305076 0.307519
chargesum: 0.00000
title: Mulliken charges with hydrogens summed into heavy atoms:
elementType: N N N N N C C C C C C C C C C C C C C C C C C
charge: -0.190936 -0.063673 -0.181633 -0.061874 -0.078146 0.033969 0.047727 0.010053 0.026622 0.516995 0.020395 -0.320879 0.336575 -0.180778 -0.042028 -0.109004 0.054333 0.388874 -0.106637 -0.169911 -0.202886 -0.221893 0.494737
polarizability: 5.23376409e+02 2.59892574e+01 2.18321634e+02 7.16952701e-01 -5.30009096e+00 1.16277011e+02
1716.lowfreq: -17.2136 -2.0481 -0.0011 0.0002 0.0011 3.1550 19.6213 28.5682 37.7106
frequency: 19.2359 28.2846 37.4101 58.3122 61.7581 96.7284 130.8673 149.8404 183.9510 207.1315 214.6421 244.3762 252.5017 279.6400 291.6284 309.8960 328.7628 341.9700 360.9457 377.2990 379.2494 387.4400 406.4753 409.4156 433.6894 449.7339 482.5694 490.1926 517.2032 532.0956 569.7825 573.9898 619.5939 635.4266 643.2818 649.8180 686.1204 716.3430 743.3207 750.4182 760.9401 803.4970 805.2363 810.2279 821.9028 826.5491 839.6851 851.5731 883.0191 923.8199 925.5843 933.8999 945.2390 961.6314 983.0527 996.1154 1008.9166 1016.1902 1045.2517 1055.7959 1066.3941 1070.1637 1076.5106 1123.7181 1127.3010 1133.4575 1148.2927 1158.7634 1191.8142 1192.1305 1202.6735 1224.2711 1231.3462 1251.7708 1262.4428 1286.6037 1289.0275 1301.4205 1306.7664 1317.5546 1333.8402 1343.0352 1350.2022 1361.9089 1372.6431 1375.8028 1382.5120 1388.5159 1428.0194 1446.6817 1453.1662 1454.9571 1458.9672 1460.4516 1466.1895 1472.6530 1479.4972 1481.3681 1503.1640 1549.3382 1574.7092 1586.5958 1633.9999 1644.0740 1645.1454 2843.2135 2847.5320 2864.8338 2896.3841 2916.2742 3019.2802 3026.6441 3031.2060 3046.7710 3077.2737 3088.9924 3106.5564 3121.5974 3133.7750 3144.6750 3158.4826 3163.5682 3167.7021 3565.7768 3609.4887 3706.1184
redmass: 4.0481 3.1894 4.3852 4.8526 3.8995 4.6549 4.7663 3.9133 4.6487 3.0856 1.3049 2.5393 4.0712 2.4848 2.8590 5.5396 3.0767 2.8669 1.3229 2.4931 1.0412 2.3111 2.8148 5.6569 3.0736 3.4617 2.7900 5.1656 2.4277 4.7337 1.1977 4.2600 2.9818 6.7043 4.4870 3.7416 5.2358 4.4647 3.7430 2.8314 3.0993 1.4081 2.8490 2.2186 3.4873 2.4106 1.6247 1.6097 5.1338 8.0924 1.4156 1.9386 1.3906 2.6718 1.3547 3.0315 2.4858 1.4511 1.7277 1.8785 2.7282 1.6831 1.7538 1.5921 1.4609 1.3147 2.6811 3.2566 1.6328 1.1138 1.3038 2.5033 2.1044 1.7782 2.2769 1.6656 1.6206 1.7214 1.5533 2.5618 1.8014 1.3250 1.5299 2.4610 1.5752 1.4531 3.8138 4.7199 1.1806 3.8699 1.0802 1.6355 1.0697 1.5984 1.1660 1.1152 1.0558 4.3152 3.3215 4.4391 6.5949 7.5347 2.1876 5.1042 2.0137 1.0706 1.0644 1.0617 1.0687 1.0709 1.0729 1.0881 1.0902 1.0902 1.1010 1.0892 1.0861 1.0896 1.0960 1.0866 1.0911 1.0951 1.0963 1.0449 1.0804 1.1040
irintensity: 0.4895 0.1873 1.8865 1.0355 2.6455 2.3632 0.7595 6.2048 0.5595 3.0037 0.0855 2.7651 8.6966 3.7734 13.4169 4.8194 17.7953 15.5214 277.0686 7.9355 7.2394 6.4342 0.5190 2.1847 3.6114 9.0208 0.1877 4.4588 6.9589 10.9691 86.1428 4.5656 9.8784 2.3255 6.9291 23.7603 5.5083 0.8246 3.3042 5.1425 5.9755 26.3965 19.2347 29.4364 18.7724 26.4699 57.2070 7.2552 19.4792 1.7263 0.0989 3.9944 1.8334 41.6591 0.3813 0.5099 63.3429 0.0874 5.7735 4.2763 0.6454 9.8791 1.9652 36.3017 16.9098 21.1030 47.8260 38.5215 107.9614 63.1627 35.9285 3.8677 39.4492 102.7274 46.7556 50.6460 9.7803 12.5324 0.5788 55.9359 35.0113 3.5018 7.0573 37.1794 37.7026 40.2630 12.7922 57.6772 1.0300 90.4236 0.8256 153.3629 24.0301 60.8665 14.2763 9.5669 12.0052 200.7610 24.8328 42.2868 4.3490 54.4314 1.0738 93.0947 605.2151 53.7169 40.7071 232.1374 76.1126 117.2877 52.1093 48.3528 70.2694 25.4191 32.6889 18.8615 28.5920 34.8574 30.7081 10.7351 16.8296 4.7146 23.2722 150.3573 19.5020 21.0400
temp: 298.150 k
press: 1.00000 atm
elementType: 7 7 7 7 7 6 6 6 6 6 6 6 6 6 6 6 6 6 6 6 6 6 6 1 1 1 1 1 1 1 1 1 1 1 1 1 1 1 1 1 1 1 1 1
symmnumber: 1
zpe: 953396.7 jmol-1
zpe.correction: 0.363130 hartree
zpe.thermalcorrener: 0.383280 hartree
zpe.thermalcorrenthalpy: 0.384225 hartree
zpe.thermalcorrgfe: 0.313370 hartree
zpe.sumelectzpe: -970.617823 hartree
zpe.sumelectthermal: -970.597672 hartree
zpe.sumelectthermalent: -970.596728 hartree
zpe.sumelectthermalfe: -970.667583 hartree
dipole: -1.0201 -3.9411 0.0888
dipole: 4.0720
quadrupole: -74.4029 -123.7530 -145.5935
quadrupole: 12.1874 -3.4472 0.6306
quadrupole: 40.1803 -9.1699 -31.0104 12.1874 -3.4472 0.6306
hfenergy: -970.9809527 hartree
pointgroup: C01 [X(C18H21N5)]
dipole: 0.3968316 1.5470901 -0.12473 debye
polarizability: 523.217358|26.6017564|218.4754471|-4.2115803|-5.2616624|116.2822496 unknown
InChI: InChI=1S/C18H21N5/c1-22-8-10-23(11-9-22)15-6-7-16-17(12-15)21-18(20-16)13-2-4-14(19)5-3-13/h2-7,12,21H,8-11,19H2,1H3
charge 0 multiplicity 1
44 atoms
N  -3.685877 -0.075271 0.015848
N  -6.431827 0.823545 0.226143
N  1.282646 0.732184 0.033496
N  1.80257 -1.490895 0.039483
N  7.921368 0.918955 -0.005574
C  -4.03256 1.343494 -0.189177
C  -4.657845 -0.768284 0.89704
C  -5.47978 1.482354 -0.696228
C  -6.090719 -0.611738 0.36433
C  -2.313858 -0.452375 0.063114
C  -7.83686 1.03278 -0.172539
C  -1.276577 0.523631 0.062119
C  0.053335 0.06085 0.042499
C  -1.965846 -1.850156 0.057056
C  0.403969 -1.330606 0.048582
C  -0.633492 -2.292204 0.058627
C  2.31171 -0.237466 0.031204
C  3.736371 0.096242 0.022746
C  4.694303 -0.957785 0.022433
C  4.221387 1.433386 0.013376
C  6.070249 -0.691721 0.013252
C  5.599553 1.712399 0.004384
C  6.552287 0.652432 0.003942
H  -3.356597 1.771728 -0.950357
H  -3.920123 1.932909 0.752021
H  -4.612781 -0.343303 1.926508
H  -4.407532 -1.838235 0.963682
H  -5.73515 2.556716 -0.764246
H  -5.541574 1.046772 -1.72743
H  -6.178158 -1.150538 -0.6147
H  -6.796392 -1.077357 1.077686
H  -8.081863 0.597296 -1.17478
H  -8.05692 2.114938 -0.206628
H  -8.507622 0.570987 0.574085
H  -1.50129 1.592608 0.104088
H  -2.765525 -2.595841 0.0122
H  -0.394731 -3.360086 0.046671
H  1.413591 1.740645 0.027396
H  4.321771 -1.986972 0.029423
H  3.52654 2.28307 0.0128
H  6.786542 -1.52269 0.013134
H  5.946147 2.753165 -0.002678
H  8.268158 1.873494 -0.011144
H  8.597799 0.161344 -0.004983
