program: Gaussian 09
title: 000183920
version: EM64L-G09RevD.01
frameworkgroup: C1[X(C17H22O3)]
method: RPBEPBE
basis: SDD
operation: Freq
keyword: #pfreq=noraman
keyword: PBEPBE/SDD
title: #p freq=noraman PBEPBE/SDD
converged: YES YES NO NO
title: Mulliken charges:
elementType: O O O C C C C C C C C C C C C C C C C C H H H H H H H H H H H H H H H H H H H H H H
charge: -0.279689 -0.234626 -0.248352 0.413456 -0.251741 -0.154331 -0.555264 -0.576941 0.405721 -0.830802 -0.507341 0.102603 0.098778 -0.406937 0.229846 -0.852395 -0.340589 -0.809601 0.285778 -0.761956 0.243773 0.287379 0.238609 0.262412 0.229436 0.238582 0.241644 0.238588 0.232690 0.221119 0.239476 0.216149 0.226716 0.227379 0.235254 0.265717 0.228861 0.229093 0.229530 0.247210 0.246310 0.248454
chargesum: 0.00000
title: Mulliken charges with hydrogens summed into heavy atoms:
elementType: O O O C C C C C C C C C C C C C C C C C
charge: -0.279689 -0.234626 -0.248352 0.413456 -0.007968 0.133048 -0.054244 -0.108923 0.405721 -0.117880 -0.046745 0.102603 0.098778 -0.190787 0.229846 -0.163046 -0.074872 -0.122116 0.285778 -0.019981
polarizability: 2.24700011e+02 -3.81352349e+00 1.94277917e+02 5.28060817e+00 1.35796591e+00 1.31397264e+02
1716.lowfreq: -8.4307 -3.1630 -0.0001 0.0009 0.0009 14.9948 29.3442 37.8023 55.7780
frequency: 29.1445 37.7209 55.7280 68.6727 74.0171 81.9027 123.7889 144.1001 156.6500 190.1444 209.2080 221.5001 240.0831 257.3287 270.8229 274.9635 282.3010 295.8721 308.7002 315.8438 331.0654 368.3722 399.7463 422.4026 460.5043 463.8118 517.4156 547.4780 559.8862 585.9399 590.8424 597.9250 624.0376 650.2750 668.8565 711.3266 728.7302 732.1093 754.6232 806.3894 840.8134 854.8251 877.3057 915.3286 941.5953 944.3240 964.3233 972.1138 988.1921 992.3097 1002.2356 1022.1608 1040.0014 1042.5044 1044.4491 1050.0881 1055.7464 1073.4444 1097.7967 1108.8594 1120.1134 1155.9981 1169.6931 1184.3285 1196.9209 1201.1008 1206.0824 1228.4383 1238.1007 1250.9800 1281.3815 1288.0177 1304.6963 1315.2872 1331.9681 1344.3926 1353.3985 1366.1931 1382.5427 1391.1617 1396.6660 1402.5658 1425.2396 1452.3316 1455.0662 1457.3850 1464.7226 1467.0122 1468.7412 1470.1098 1474.9849 1479.8961 1488.1983 1497.1479 1559.5363 1638.6684 1647.6974 1682.0316 2914.3834 2961.1327 2963.4865 2967.3012 2971.6474 2973.6308 2990.1791 3006.8880 3011.3725 3021.3191 3026.1124 3030.8980 3036.1511 3045.0414 3077.3073 3082.3703 3085.3943 3087.9911 3096.7980 3103.1809 3142.5459 3252.9879
redmass: 9.9969 1.3527 4.1003 3.0821 2.1173 2.9566 1.1345 3.0239 2.9465 3.0600 4.1360 1.3544 2.4200 2.8004 2.1711 2.2830 2.5948 2.6014 1.7107 3.2807 2.5574 4.7981 2.5843 3.3432 3.7885 3.3231 3.4419 3.5144 3.1627 3.5989 3.7242 4.2741 3.6605 3.7038 3.8454 2.7047 1.4197 4.0675 4.9247 1.4167 3.7825 2.4790 3.0466 1.9548 2.1806 2.6773 1.7694 2.2183 1.6287 1.9358 1.9071 2.2046 1.6754 1.7087 1.6062 2.0044 3.9076 2.4138 2.5057 1.9886 2.4642 2.0743 1.2998 2.0515 1.7951 1.7056 2.9620 1.7962 1.6711 1.9697 1.6783 1.4254 1.3702 1.5620 1.9903 1.9511 1.5703 1.3508 1.2489 1.2428 1.2331 1.2620 4.5486 1.0633 1.0487 1.0780 1.0901 1.0624 1.0621 1.0781 1.1253 1.1091 1.0575 1.0563 5.3750 7.5548 9.2585 7.0727 1.0811 1.0548 1.0465 1.0621 1.0376 1.0619 1.0354 1.0373 1.0893 1.0960 1.0975 1.0936 1.0962 1.0979 1.0984 1.0979 1.0994 1.0993 1.0964 1.0908 1.1013 1.0999
irintensity: 1.9550 2.0791 0.8736 0.1235 1.3398 0.3848 0.1979 0.6740 0.7726 3.2193 1.6095 3.0693 2.4027 1.2460 2.6059 3.7053 1.9630 0.4910 5.4213 1.6487 0.9023 3.6180 2.3168 1.5723 5.4664 1.6689 0.5496 1.0250 4.4101 0.6745 7.1564 8.4721 2.1703 1.3096 3.0286 2.7053 35.4213 8.0959 6.6710 11.2397 10.2067 4.9927 3.8132 5.3311 55.6114 56.5187 6.9331 2.6809 14.0246 100.6124 27.3376 22.0596 10.9562 6.4436 5.9758 4.4824 10.1976 3.4044 8.7990 3.3170 0.1028 9.6316 1.0586 52.0776 100.1920 19.4366 221.7027 2.6436 2.1994 1.0328 3.7382 4.2451 3.6610 5.2490 7.2203 1.4016 7.0076 3.1767 54.5838 33.8611 14.7617 8.4108 13.9023 22.7643 20.0533 15.7515 8.6694 4.6922 17.9790 13.2691 21.3055 1.7404 1.9079 1.0319 1.5526 8.8883 167.3724 1.9856 14.6035 14.1265 47.8804 27.4658 40.9382 25.3892 20.0921 2.6477 14.0506 27.3654 8.2333 28.1666 22.6932 23.3105 29.3241 24.8768 17.3744 21.2894 8.7571 41.0279 10.6138 0.2573
temp: 298.150 k
press: 1.00000 atm
elementType: 8 8 8 6 6 6 6 6 6 6 6 6 6 6 6 6 6 6 6 6 1 1 1 1 1 1 1 1 1 1 1 1 1 1 1 1 1 1 1 1 1 1
symmnumber: 1
zpe: 921576.5 jmol-1
zpe.correction: 0.351010 hartree
zpe.thermalcorrener: 0.370904 hartree
zpe.thermalcorrenthalpy: 0.371848 hartree
zpe.thermalcorrgfe: 0.302653 hartree
zpe.sumelectzpe: -885.161937 hartree
zpe.sumelectthermal: -885.142044 hartree
zpe.sumelectthermalent: -885.141099 hartree
zpe.sumelectthermalfe: -885.210294 hartree
dipole: -0.7309 2.1557 1.8096
dipole: 2.9079
quadrupole: -107.1081 -116.0237 -126.2525
quadrupole: -2.9275 7.3126 -4.8676
quadrupole: 9.3533 0.4377 -9.7910 -2.9275 7.3126 -4.8676
hfenergy: -885.5129474 hartree
pointgroup: C01 [X(C17H22O3)]
dipole: -0.2380198 0.8337976 0.7463168 debye
polarizability: 223.6349564|-6.4654588|194.8293251|7.2258144|3.7557622|131.9109097 unknown
InChI: InChI=1S/C17H22O3/c1-10-5-6-16(20-12(3)18)17(4)8-15-13(7-14(10)17)11(2)9-19-15/h5,9,14,16H,6-8H2,1-4H3
charge 0 multiplicity 1
42 atoms
O  2.852768 -0.724378 0.55606
O  -2.169478 -2.443176 -0.27007
O  3.2553 -1.575085 -1.588314
C  0.524624 0.161668 0.40181
C  -0.299873 1.305882 -0.307393
C  2.007133 0.386349 0.004107
C  0.04878 -1.226931 -0.143292
C  -1.808342 1.24527 0.089336
C  0.322264 2.693432 -0.103446
C  0.353558 0.205741 1.94287
C  2.573701 1.699511 0.555639
C  -2.312751 -0.16969 -0.052077
C  -1.445156 -1.240199 -0.158455
C  1.620416 2.846988 0.281469
C  -3.668442 -0.7030 -0.095683
C  -0.540667 3.901861 -0.421475
C  -3.535797 -2.074988 -0.230065
C  -4.949595 0.0857 -0.015047
C  3.419336 -1.632146 -0.34836
C  4.232688 -2.669082 0.396572
H  -0.26647 1.089575 -1.400988
H  2.097901 0.354592 -1.098659
H  0.441187 -2.036424 0.501417
H  0.461238 -1.400495 -1.158538
H  -2.390064 1.93095 -0.555981
H  -1.942537 1.609604 1.128869
H  -0.647138 -0.156586 2.235241
H  1.105392 -0.444286 2.424522
H  0.475258 1.230472 2.335784
H  3.557524 1.902676 0.089901
H  2.763884 1.59557 1.643149
H  2.029232 3.860969 0.391613
H  -0.939379 3.84821 -1.454225
H  0.037557 4.837571 -0.32971
H  -1.415045 3.976755 0.252889
H  -4.244854 -2.894101 -0.309238
H  -5.017743 0.828142 -0.833073
H  -5.833597 -0.571194 -0.084687
H  -5.020722 0.644241 0.937734
H  4.909053 -2.18302 1.119031
H  4.809548 -3.272615 -0.318877
H  3.558613 -3.331236 0.969139
