program: Gaussian 09
title: 000183929
version: EM64L-G09RevD.01
frameworkgroup: C1[X(C17H24O6)]
method: RPBEPBE
basis: SDD
operation: Freq
keyword: #pfreq=noraman
keyword: PBEPBE/SDD
title: #p freq=noraman PBEPBE/SDD
converged: YES YES NO NO
title: Mulliken charges:
elementType: O O O O O O C C C C C C C C C C C C C C C C C H H H H H H H H H H H H H H H H H H H H H H H H
charge: -0.308491 -0.272671 -0.458556 -0.258355 -0.431565 -0.258924 0.397331 -0.445672 -0.073284 -0.767495 -0.294346 -0.015634 -0.198193 0.193619 -0.363816 -0.184261 -0.750403 -0.718933 -0.201428 -0.214801 -0.134416 -0.323585 0.155693 0.221074 0.253051 0.266323 0.232698 0.232152 0.247334 0.248249 0.208228 0.255840 0.235446 0.197092 0.275325 0.215885 0.218672 0.236882 0.208017 0.222388 0.226207 0.366933 0.230482 0.237830 0.259856 0.255816 0.376403
chargesum: 0.00000
title: Mulliken charges with hydrogens summed into heavy atoms:
elementType: O O O O O O C C C C C C C C C C C C C C C C C
charge: -0.308491 -0.272671 -0.091623 -0.258355 -0.055162 -0.258924 0.397331 0.028453 0.193038 -0.055311 -0.046096 0.192594 0.057646 0.193619 0.068722 0.091064 -0.078964 -0.062320 0.029054 0.023029 0.125440 -0.067769 0.155693
polarizability: 4.44708521e+02 -1.68065715e+01 1.94905274e+02 -1.95059059e+01 -9.52652225e-01 1.39815546e+02
1716.lowfreq: -12.7375 -4.3505 -0.0006 -0.0002 0.0009 1.3210 12.6257 17.8794 18.4447
frequency: 12.0888 17.6613 18.2088 29.1231 35.4614 42.9575 63.7718 70.8915 73.7466 86.3760 90.8950 116.4244 146.8936 152.7344 157.8747 169.6746 177.1489 191.9200 200.4634 220.3893 232.0383 248.2076 252.3095 268.1573 292.0874 295.9856 319.5852 325.9570 352.8352 354.1159 366.7465 379.6889 403.8934 419.0029 431.8485 481.8919 527.2093 545.0916 580.2011 588.6561 610.9819 619.9129 641.9777 686.1281 693.4412 737.7134 762.8076 777.1849 817.7038 824.2779 849.9463 863.0859 872.1469 882.9503 909.2434 914.1315 923.1287 933.8309 938.9755 958.8407 985.4367 992.1451 1001.2165 1021.3218 1029.9173 1041.4400 1043.3923 1049.9714 1081.5737 1096.4918 1098.8450 1118.8840 1134.1893 1162.9009 1169.9062 1170.4575 1175.8893 1203.9230 1227.4126 1237.6665 1254.4449 1259.5458 1264.5854 1265.5905 1275.7152 1281.8666 1293.8735 1299.9344 1308.4246 1309.3657 1327.5726 1349.3261 1357.1518 1368.7985 1379.3783 1389.0616 1391.8241 1400.3012 1457.4972 1462.4951 1471.4143 1476.0733 1478.4010 1484.0298 1487.5376 1487.8455 1589.7030 1608.1817 1610.5762 1642.7075 1650.8526 2973.7187 2974.1649 2979.5027 2982.2439 2993.1330 2994.0504 3017.5968 3038.8733 3064.9179 3070.8560 3073.2756 3074.7080 3084.9586 3086.0602 3087.3663 3097.1600 3104.4255 3108.5146 3110.2829 3120.9611 3157.8448 3185.3322 3480.3929 3525.5573
redmass: 4.7864 4.5156 3.3576 4.9177 5.5042 4.8630 4.6858 4.6230 4.0622 2.6647 4.2231 4.2248 2.7736 3.3590 1.4129 1.9964 5.0644 2.2199 1.3831 1.7963 3.0651 3.3551 3.0037 2.9500 3.1058 2.9255 4.1545 3.8359 3.2544 1.2968 2.7263 3.0414 3.1563 4.1094 3.0361 4.0736 4.3283 4.4870 1.2582 3.1161 4.9298 4.6999 3.6047 3.5380 4.7449 4.7863 2.6003 1.5113 1.9908 2.7200 2.9977 2.7738 2.2842 4.4821 1.4108 1.7927 5.6065 2.5122 1.2667 1.4101 2.2284 1.1921 1.7227 1.4648 1.1010 3.5431 2.1229 1.3756 1.5862 2.2455 2.1984 2.2842 1.2889 2.5610 2.0707 1.9945 1.7705 1.5455 1.3672 1.3904 1.2440 1.6325 1.4415 1.3368 1.5075 2.2982 1.7767 1.3200 1.3137 1.6620 1.3219 1.5750 1.9358 1.3680 1.7380 1.2149 1.2110 1.5187 1.0513 1.0694 1.0516 1.0757 1.0516 1.0584 1.0492 1.1757 5.8985 9.9381 6.5517 6.1223 5.9057 1.0485 1.0370 1.0697 1.0621 1.0780 1.0410 1.0837 1.0989 1.0976 1.1009 1.0983 1.0537 1.0996 1.0978 1.0927 1.0915 1.1003 1.0919 1.0917 1.0866 1.0920 1.1189 1.0652 1.0640
irintensity: 0.3472 0.5768 0.6312 0.2713 0.0488 0.4752 2.8862 0.0233 1.6038 0.8052 0.1210 2.0287 0.2297 1.2798 2.5498 0.8527 2.3786 2.6594 8.4577 3.6627 0.1833 2.1026 11.4097 10.8888 1.0290 3.5434 13.7923 50.1405 10.0874 84.9400 15.7185 11.2723 2.0522 30.7277 5.5886 4.9266 8.3005 13.3252 112.3898 11.7688 11.0757 11.7007 16.0981 48.0225 10.8649 6.8872 8.8766 6.6372 1.2831 11.6419 1.0218 32.3272 46.9301 77.6767 3.5459 2.4142 25.6548 14.3739 2.3326 63.8559 114.3779 5.8656 14.4618 45.4464 145.3678 20.7064 747.8326 10.0454 6.5462 85.4975 7.3541 214.8311 16.9904 200.5909 15.2813 63.4784 3.0730 13.1035 158.7340 2.9791 8.1221 10.5095 8.3348 22.6970 21.0592 2.5296 0.5425 5.1265 1.7857 17.6511 0.7476 1.7398 121.0725 52.5689 7.4908 19.1990 16.5489 27.4971 5.5241 4.8430 4.1247 6.9118 12.2468 7.8833 15.3315 7.3821 23.2445 192.1500 585.8736 87.6383 47.4505 22.6757 27.7050 17.2653 37.7150 20.9786 7.3348 25.3844 1.9183 53.5272 47.1067 66.5797 20.3589 33.8813 16.2864 3.8464 3.6331 17.2956 14.3926 1.1220 19.7133 6.6797 12.3420 33.4049 67.6363
temp: 298.150 k
press: 1.00000 atm
elementType: 8 8 8 8 8 8 6 6 6 6 6 6 6 6 6 6 6 6 6 6 6 6 6 1 1 1 1 1 1 1 1 1 1 1 1 1 1 1 1 1 1 1 1 1 1 1 1
symmnumber: 1
zpe: 993328.6 jmol-1
zpe.correction: 0.378339 hartree
zpe.thermalcorrener: 0.405096 hartree
zpe.thermalcorrenthalpy: 0.406040 hartree
zpe.thermalcorrgfe: 0.316687 hartree
zpe.sumelectzpe: -1111.705153 hartree
zpe.sumelectthermal: -1111.678396 hartree
zpe.sumelectthermalent: -1111.677452 hartree
zpe.sumelectthermalfe: -1111.766804 hartree
dipole: 2.1881 -0.9346 2.4038
dipole: 3.3822
quadrupole: -155.5746 -143.6550 -140.1699
quadrupole: 4.0887 7.7347 -0.9929
quadrupole: -9.1081 2.8115 6.2966 4.0887 7.7347 -0.9929
hfenergy: -1112.0834914 hartree
pointgroup: C01 [X(C17H24O6)]
dipole: 0.9096027 -0.5128911 0.8247687 debye
polarizability: 444.1435794|2.5119326|192.1712713|-29.7170528|9.3786626|143.1144901 unknown
InChI: InChI=1S/C17H24O6/c1-4-12(2)15(20)16(21)23-13(17(3)11-22-17)9-7-5-6-8-10-14(18)19/h5-10,12-13,15,18,20H,4,11H2,1-3H3
charge 0 multiplicity 1
47 atoms
O  0.41861 -3.03348 -0.511261
O  2.060448 0.413048 -0.462453
O  5.393492 1.39459 -1.632859
O  3.483555 -0.504166 -2.07625
O  -8.828324 -0.25132 0.534117
O  -7.762821 1.813541 0.35189
C  1.201217 -1.852686 0.043782
C  1.930623 -3.003007 -0.581983
C  0.988961 -0.594569 -0.813428
C  1.163602 -1.686642 1.550269
C  -0.325676 0.115922 -0.6058
C  4.731839 1.118552 0.759071
C  4.26337 1.382235 -0.7100
C  3.250164 0.334659 -1.169193
C  5.685834 2.2499 1.224978
C  -1.526677 -0.515622 -0.417628
C  5.407889 -0.265143 0.888119
C  5.02188 3.637854 1.355581
C  -2.780998 0.199869 -0.273527
C  -4.003926 -0.415443 -0.096781
C  -5.24199 0.317245 0.049023
C  -6.475034 -0.265889 0.224786
C  -7.684962 0.556915 0.367007
H  2.425789 -3.730664 0.072273
H  2.344922 -2.895502 -1.590832
H  1.134763 -0.863873 -1.879716
H  1.987963 -1.029664 1.882677
H  1.27088 -2.666144 2.045232
H  0.212733 -1.23264 1.877573
H  -0.279572 1.212328 -0.663508
H  3.818149 1.144617 1.389439
H  3.780857 2.37648 -0.757676
H  6.533288 2.304411 0.515285
H  6.106123 1.954903 2.207304
H  -1.559156 -1.613181 -0.383797
H  4.736049 -1.092144 0.588068
H  5.715658 -0.445306 1.933648
H  6.311663 -0.31178 0.254228
H  4.147588 3.605257 2.03333
H  5.736402 4.375693 1.763434
H  4.680811 4.025093 0.377797
H  5.332137 0.577955 -2.199967
H  -2.742535 1.299583 -0.308741
H  -4.05068 -1.513724 -0.064525
H  -5.200433 1.416341 0.018795
H  -6.604167 -1.3524 0.265042
H  -9.623614 0.339701 0.626277
