program: Gaussian 09
title: 000183893
version: EM64L-G09RevD.01
frameworkgroup: C1[X(C14H9Cl5O2)]
method: RPBEPBE
basis: SDD
operation: Freq
keyword: #p
keyword: freq=noraman
keyword: PBEPBE/SDD
title: #p freq=noraman PBEPBE/SDD
converged: YES YES NO NO
title: Mulliken charges:
elementType: Cl Cl Cl Cl Cl O O C C C C C C C C C C C C C C H H H H H H H H H
charge: 0.029110 0.044318 0.044472 -0.001269 -0.013847 -0.284731 -0.279915 0.311564 0.454638 0.114215 0.391753 -0.328393 -0.337887 -0.135706 -0.272368 -0.350965 -0.089115 -0.219850 -0.236839 -0.525980 -0.523373 0.252328 0.239965 0.261988 0.259522 0.239213 0.233935 0.251533 0.233002 0.238682
chargesum: 0.00000
title: Mulliken charges with hydrogens summed into heavy atoms:
elementType: Cl Cl Cl Cl Cl O O C C C C C C C C C C C C C C
charge: 0.029110 0.044318 0.044472 -0.001269 -0.013847 -0.284731 -0.279915 0.311564 0.454638 0.114215 0.391753 -0.328393 -0.337887 -0.135706 -0.272368 -0.098637 -0.089115 0.020115 0.025149 0.206690 0.199844
polarizability: 2.72139576e+02 3.50082772e-01 1.94271377e+02 1.12257485e+01 3.28456192e-01 1.59915691e+02
1716.lowfreq: -5.9512 -4.7243 -0.0010 0.0021 0.0025 4.1249 15.8262 32.8515 39.6357
frequency: 15.6097 32.8295 39.6085 46.3095 66.6980 77.7189 96.6118 101.8191 112.8245 140.2194 153.6043 160.7986 184.5530 193.0712 202.5785 204.9407 207.4223 235.0520 256.1971 266.5560 290.5898 307.5374 328.0284 334.0910 372.3834 408.3979 421.4422 428.9722 462.1269 496.2128 504.5007 525.1506 612.6744 645.8814 665.6617 670.0199 703.8401 714.3375 742.3044 757.2979 795.3736 812.8203 856.7027 875.3309 905.2044 966.6024 970.8021 975.9364 1020.5591 1081.6550 1110.9691 1115.9474 1127.4695 1151.5906 1152.2754 1158.1506 1189.4152 1215.1935 1281.9992 1322.0756 1353.3413 1360.1375 1374.9596 1403.6779 1430.5531 1434.6023 1453.7456 1460.5381 1462.5488 1472.1420 1483.0898 1542.3462 1553.3342 1561.3332 1598.5201 2981.0787 2988.9851 3081.9684 3093.6857 3132.5290 3134.2730 3147.5803 3163.0814 3178.4154
redmass: 10.5323 8.5305 6.3915 4.8002 5.6078 10.0249 7.1411 7.8894 2.9631 4.1880 1.2126 1.0805 10.5444 26.4992 5.9997 29.9080 5.9398 8.0119 6.6999 7.7399 6.8084 9.2229 20.4441 8.5124 13.3503 10.6542 8.5084 8.4727 9.9424 7.1930 4.0005 6.3183 8.9419 10.5920 8.7521 8.8352 6.5553 7.5292 2.6668 8.2145 1.9038 9.4304 9.4906 8.4421 1.3969 11.4080 8.6731 1.3900 6.8954 2.5651 1.2335 1.2269 2.4145 1.7092 1.3699 1.6207 1.9485 2.5080 5.1374 11.3905 9.9325 5.6695 3.6271 2.8854 1.3000 1.2650 3.2172 1.0555 1.0635 1.0578 1.0537 8.5314 11.0175 6.6752 7.6908 1.0299 1.0294 1.1058 1.1056 1.1029 1.1040 1.0870 1.0930 1.0997
irintensity: 0.2724 0.2236 1.9852 1.9696 0.7192 0.4133 2.1223 0.1218 7.4578 2.7118 0.3446 0.1611 2.4141 0.0410 0.7299 0.1201 4.3832 1.3291 8.5347 2.6090 4.9023 1.2709 0.6384 2.6332 3.5317 0.3543 1.5753 4.0351 9.7918 1.4046 0.2017 1.6384 35.9627 0.5860 11.7511 9.3602 27.6433 35.5643 68.5119 22.7406 24.1325 6.5375 13.8175 57.4119 0.0801 72.1131 76.9447 2.6874 21.0317 17.8705 3.8727 4.3232 21.6141 16.8107 2.0413 11.1262 2.5280 3.9091 28.5111 17.4803 12.6754 268.6634 93.5366 48.0081 41.3792 14.7056 6.0717 12.0733 3.2140 8.6930 15.9127 4.4821 11.1666 14.2309 12.0726 55.1121 50.7586 21.9153 13.9603 18.6207 14.2125 3.5435 4.5619 8.1306
temp: 298.150 k
press: 1.00000 atm
elementType: 17 17 17 17 17 8 8 6 6 6 6 6 6 6 6 6 6 6 6 6 6 1 1 1 1 1 1 1 1 1
symmnumber: 1
zpe: 503143.4 jmol-1
zpe.correction: 0.191637 hartree
zpe.thermalcorrener: 0.213363 hartree
zpe.thermalcorrenthalpy: 0.214307 hartree
zpe.thermalcorrgfe: 0.137934 hartree
zpe.sumelectzpe: -2988.074691 hartree
zpe.sumelectthermal: -2988.052966 hartree
zpe.sumelectthermalent: -2988.052022 hartree
zpe.sumelectthermalfe: -2988.128394 hartree
dipole: 0.6108 3.5411 3.2772
dipole: 4.8634
quadrupole: -156.4696 -148.6060 -148.1021
quadrupole: -5.2559 3.3512 0.7969
quadrupole: -5.4104 2.4532 2.9571 -5.2559 3.3512 0.7969
hfenergy: -2988.2663286 hartree
pointgroup: C01 [X(C14H9Cl5O2)]
dipole: -0.176727 -1.4090759 1.2823376 debye
polarizability: 272.1432463|8.8748475|195.272638|-3.2690021|-0.9906863|158.9107597 unknown
InChI: InChI=1S/C14H9Cl5O2/c1-20-13-8(6-4-3-5-7(15)9(6)16)10(17)11(18)12(19)14(13)21-2/h3-5H,1-2H3
charge 0 multiplicity 1
30 atoms
Cl -0.341575 3.080674 0.247928
Cl 4.697883 0.765062 -0.446357
Cl 2.830075 3.415316 -0.253404
Cl -1.635435 0.113984 -2.323621
Cl -4.81973 -0.287842 -1.74744
O  0.369639 -2.071044 0.261374
O  3.176004 -1.801981 -0.209173
C  0.120118 0.338492 0.224458
C  -1.349145 0.160698 0.455284
C  0.953501 -0.804106 0.107641
C  2.357278 -0.670257 -0.086145
C  0.715373 1.618117 0.119172
C  2.918425 0.623155 -0.201114
C  2.102921 1.774804 -0.105542
C  -2.261212 0.039496 -0.622605
C  -1.853453 0.098283 1.777094
C  -3.640893 -0.132486 -0.379565
C  -3.232345 -0.072296 2.018788
C  -4.134139 -0.188277 0.939529
C  0.428508 -2.956552 -0.935476
C  3.41279 -2.528664 1.065974
H  -1.151907 0.186851 2.612192
H  -3.610112 -0.115488 3.044891
H  -5.206626 -0.320065 1.109225
H  1.4750 -3.1212 -1.243764
H  -0.152618 -2.504414 -1.758642
H  -0.038486 -3.898554 -0.612776
H  2.45486 -2.860775 1.504463
H  3.959176 -1.877881 1.772683
H  4.034725 -3.393751 0.793431
