program: Gaussian 09
title: 000183889
version: EM64L-G09RevD.01
frameworkgroup: C1[X(C18H19NO3)]
method: RPBEPBE
basis: SDD
operation: Freq
keyword: #p
keyword: freq=noraman
keyword: PBEPBE/SDD
title: #p freq=noraman PBEPBE/SDD
converged: YES YES NO NO
title: Mulliken charges:
elementType: O O O N C C C C C C C C C C C C C C C C C C H H H H H H H H H H H H H H H H H H H
charge: -0.215005 -0.236229 -0.222797 -0.011859 0.191573 0.192980 -0.139999 -0.369103 -0.376145 0.116161 -0.741598 -0.720622 -0.737519 0.375433 -0.128589 -0.384067 -0.338668 -0.379762 -0.382885 0.300724 0.112189 -0.465709 0.270597 0.243510 0.232510 0.249650 0.239413 0.214610 0.226186 0.230196 0.223096 0.226484 0.221864 0.211800 0.223538 0.232074 0.268175 0.264339 0.250259 0.252077 0.281119
chargesum: 0.00000
title: Mulliken charges with hydrogens summed into heavy atoms:
elementType: O O O N C C C C C C C C C C C C C C C C C C
charge: -0.215005 -0.236229 -0.222797 -0.011859 0.191573 0.192980 0.130598 0.106917 0.112918 0.116161 -0.070607 -0.049177 -0.070107 0.375433 -0.128589 -0.115892 -0.074329 -0.129503 -0.130808 0.300724 0.112189 -0.184590
polarizability: 3.20895457e+02 -2.87564876e+00 1.83166710e+02 3.31933431e+00 1.13627045e+01 1.29671623e+02
1716.lowfreq: -1.3517 -0.0004 0.0004 0.0006 8.4834 16.8904 19.7362 40.9270 60.6708
frequency: 19.2894 40.8094 60.6647 68.0842 101.2320 121.8644 130.7879 138.9655 188.7701 202.1000 208.6584 218.7803 239.0846 255.1579 274.5077 288.3583 306.9280 319.4654 330.4576 336.0492 358.1118 374.5070 396.0650 403.7912 412.6876 442.8445 451.7947 463.9769 506.4232 516.7281 523.9186 545.6832 552.4753 565.6836 601.9483 619.2072 628.3242 636.8982 649.2263 699.4656 740.1884 769.1420 793.9964 817.6611 827.2015 858.2664 868.1758 885.9240 906.3050 922.8978 927.9999 928.7707 930.6019 940.4732 944.9837 949.3050 981.7071 991.1565 991.3965 1008.5241 1015.3327 1023.2520 1049.3654 1077.3347 1121.1637 1124.2475 1133.3411 1188.2843 1193.4392 1207.8047 1213.3111 1223.1623 1238.8137 1248.5232 1259.3994 1290.6648 1304.3078 1320.8420 1329.3667 1350.9756 1358.5392 1385.0991 1388.7370 1409.7434 1415.7849 1460.7841 1462.0202 1464.9756 1470.6665 1482.3968 1491.7770 1492.9591 1493.5294 1504.9602 1567.6725 1624.3011 2130.8486 2190.5882 2976.7293 2980.0863 2985.2989 3012.1963 3017.9523 3032.4098 3068.8984 3071.1540 3073.7640 3078.8178 3080.0815 3086.2976 3093.9361 3097.9852 3152.3269 3153.4055 3174.7602 3180.6650 3429.7739
redmass: 3.8632 5.5175 5.6825 3.2966 6.4685 5.2571 6.8653 4.9015 3.3148 3.3246 2.3397 1.4592 4.2521 1.2724 1.2420 3.1615 2.2222 2.9307 4.2278 4.1164 2.8697 2.6685 4.4960 2.9100 3.2180 3.7860 4.8185 6.2556 6.9207 3.3902 6.2286 4.5525 5.5833 3.7277 4.4183 1.2608 6.3512 5.6735 1.2832 7.5588 3.8766 6.2242 2.9440 3.7504 4.3825 1.2793 2.5294 3.0485 3.1640 1.7808 2.3170 4.1150 2.9090 1.4611 3.3845 2.4840 1.4027 2.6707 1.4195 3.8095 1.4792 1.4665 3.6164 3.5563 1.3898 1.9554 2.6177 1.2220 1.2395 2.7145 2.0201 2.1903 2.7112 1.7382 1.6381 1.3278 1.2816 3.9636 1.2928 1.3297 4.9129 1.1907 1.1933 3.5720 1.1978 1.0590 1.0516 1.0516 1.0699 1.0796 1.0519 1.0573 1.0594 2.7652 7.3684 6.2972 6.2600 12.5724 1.0358 1.0358 1.0368 1.0617 1.0601 1.0838 1.0992 1.1000 1.1001 1.0992 1.0982 1.1002 1.1057 1.1039 1.0889 1.0892 1.0966 1.0965 1.1560
irintensity: 0.2171 1.0410 1.5948 0.3862 0.3062 0.3828 2.3048 0.5237 2.4328 0.3854 0.5678 0.5948 9.0599 0.5204 0.5689 13.5048 0.0459 3.5044 10.0610 0.4944 2.1846 0.4275 0.1138 0.0220 0.0247 0.6028 1.0251 2.5237 0.8170 0.4458 0.1701 6.2911 4.4538 5.2129 7.7781 66.4026 1.6309 0.4153 66.2631 3.9787 9.7433 2.3622 0.5656 195.1013 31.7101 0.3345 14.1089 8.2788 13.4063 6.2758 37.0550 69.9419 13.3387 10.1912 25.0716 29.7685 2.2932 28.1788 1.5520 91.2688 2.0338 2.7803 157.1312 28.3043 1.3569 2.5571 3.2744 30.2694 0.5635 0.5182 8.0129 23.4139 40.3282 1.8279 2.9750 4.4951 1.1492 270.1647 10.2593 3.4548 1.7099 26.5523 22.5247 11.3318 22.6290 0.8748 1.0781 0.3501 5.0619 5.5112 13.4902 10.9360 33.0920 2.2232 0.9591 12.6259 5.6484 1.2326 24.0561 19.9467 11.8981 48.6792 45.0609 12.8049 12.8396 2.5838 7.7597 44.2471 93.1145 35.4970 10.6823 24.6054 4.1510 6.6592 5.8660 1.3204 101.2260
temp: 298.150 k
press: 1.00000 atm
elementType: 8 8 8 7 6 6 6 6 6 6 6 6 6 6 6 6 6 6 6 6 6 6 1 1 1 1 1 1 1 1 1 1 1 1 1 1 1 1 1 1 1
symmnumber: 1
zpe: 853172.5 jmol-1
zpe.correction: 0.324956 hartree
zpe.thermalcorrener: 0.345591 hartree
zpe.thermalcorrenthalpy: 0.346535 hartree
zpe.thermalcorrgfe: 0.276461 hartree
zpe.sumelectzpe: -976.015776 hartree
zpe.sumelectthermal: -975.995142 hartree
zpe.sumelectthermalent: -975.994198 hartree
zpe.sumelectthermalfe: -976.064271 hartree
dipole: 4.4305 -3.8011 -0.1928
dipole: 5.8408
quadrupole: -106.0305 -139.8364 -131.0815
quadrupole: -9.1123 0.1731 3.4373
quadrupole: 19.6190 -14.1869 -5.4320 -9.1123 0.1731 3.4373
hfenergy: -976.3407327 hartree
pointgroup: C01 [X(C18H19N1O3)]
dipole: -1.7019586 -1.5153703 0.2958953 debye
polarizability: 320.4139739|8.0386794|178.3732599|6.1206374|-19.2170735|134.9465556 unknown
InChI: InChI=1S/C18H19NO3/c1-5-13-6-8-14(9-7-13)18-20-11-17(12-21-18,16(2,3)4)15(10-19)22-18/h1,6-9,15H,11-12H2,2-4H3
charge 0 multiplicity 1
41 atoms
O  -0.401141 0.527935 1.036247
O  -0.292778 -1.681758 0.151839
O  -0.377914 0.179464 -1.333299
N  -2.076266 3.228979 -0.277097
C  -2.420249 -0.409956 -0.072248
C  -3.998125 -0.54063 -0.070672
C  -1.853564 0.785237 0.783128
C  -1.730559 -1.668342 0.543336
C  -1.801768 -0.245774 -1.489371
C  0.152282 -0.316725 -0.068595
C  -4.500841 -1.054125 1.310179
C  -4.692547 0.818997 -0.364968
C  -4.447626 -1.551988 -1.165965
C  1.653192 -0.214245 -0.050379
C  -1.992031 2.128336 0.174489
C  2.439268 -1.23091 0.536728
C  2.274476 0.934579 -0.596343
C  3.841049 -1.104933 0.576785
C  3.674218 1.064207 -0.557867
C  4.478891 0.045534 0.031447
C  5.908634 0.178068 0.075064
C  7.13799 0.292791 0.1132
H  -2.31726 0.802178 1.786585
H  -1.794663 -1.670863 1.646511
H  -2.149244 -2.604215 0.140507
H  -1.827747 -1.196948 -2.049564
H  -2.279558 0.554029 -2.077585
H  -4.174699 -0.405639 2.14455
H  -5.60594 -1.063317 1.315913
H  -4.162089 -2.084296 1.521854
H  -4.333951 1.284347 -1.299979
H  -4.549238 1.549162 0.451093
H  -5.780563 0.653554 -0.470478
H  -3.961836 -2.538978 -1.061139
H  -5.538811 -1.710975 -1.089611
H  -4.241767 -1.172867 -2.183119
H  1.946155 -2.113883 0.951765
H  1.657804 1.715255 -1.051318
H  4.453529 -1.890951 1.029535
H  4.158382 1.95083 -0.978765
H  8.207003 0.393839 0.146409
