program: Gaussian 09
title: 000183897
version: EM64L-G09RevD.01
frameworkgroup: C1[X(C20H21NO5)]
method: RPBEPBE
basis: SDD
operation: Freq
keyword: #p
keyword: freq=noraman
keyword: PBEPBE/SDD
title: #p freq=noraman PBEPBE/SDD
converged: YES YES NO NO
title: Mulliken charges:
elementType: O O O O O N C C C C C C C C C C C C C C C C C C C C H H H H H H H H H H H H H H H H H H H H H
charge: -0.286708 -0.452442 -0.443475 -0.259442 -0.279801 -0.227802 0.304344 -0.265892 -0.129531 0.114317 0.163032 0.176964 -0.722772 -0.743682 0.015823 -0.623055 0.219951 0.216743 0.082883 0.170864 -0.683249 -0.354322 -0.362836 -0.239832 -0.263559 -0.521134 0.260311 0.232759 0.244108 0.237267 0.211237 0.243845 0.220129 0.242101 0.285360 0.370003 0.364926 0.287577 0.245400 0.231100 0.251900 0.281054 0.227819 0.232922 0.207280 0.292595 0.224919
chargesum: 0.00000
title: Mulliken charges with hydrogens summed into heavy atoms:
elementType: O O O O O N C C C C C C C C C C C C C C C C C C C C
charge: -0.286708 -0.082439 -0.078549 -0.259442 -0.279801 -0.227802 0.304344 -0.005581 0.103228 0.114317 0.163032 0.176964 -0.030160 -0.037608 0.015823 -0.337695 0.219951 0.216743 0.082883 0.170864 0.080828 -0.102422 -0.081782 -0.012013 -0.030637 0.203661
polarizability: 3.60870672e+02 1.56592770e+01 2.77089004e+02 1.71645095e+01 -1.26274608e+01 1.45675130e+02
1716.lowfreq: -9.5165 -7.4244 -3.2625 -0.0009 -0.0009 -0.0007 38.2234 43.6345 55.3263
frequency: 38.1622 43.6319 55.2991 81.5401 105.2132 115.5252 123.9717 147.5547 150.5610 178.4660 185.4053 195.5364 205.6003 220.9729 230.5699 238.7174 261.6439 272.4144 288.1053 293.8403 304.6354 313.6824 339.7140 341.1892 345.0638 368.6468 394.5164 405.9770 406.9156 426.7289 440.9507 455.5137 471.4909 482.0465 503.4872 522.4200 535.9672 551.2441 566.8802 594.3643 608.0500 625.2956 638.1391 646.2247 680.0522 686.7856 732.0261 762.3270 768.2390 781.3072 802.3739 810.8534 821.8902 858.2556 859.6959 871.9567 894.0846 909.8740 935.7711 941.6099 967.5690 968.6089 974.1990 988.6211 998.5058 1001.0575 1038.5370 1061.0707 1080.5723 1103.9400 1107.1614 1114.2603 1125.6084 1132.0574 1145.4149 1166.4153 1172.0912 1180.5738 1196.8426 1207.6656 1219.9287 1236.3572 1246.8307 1259.9125 1279.5652 1288.1277 1299.8231 1322.1731 1344.8187 1354.7185 1360.6380 1372.8199 1381.7339 1389.6435 1400.1213 1402.1786 1413.0768 1430.7038 1438.7386 1449.3458 1455.0447 1464.0529 1465.9187 1475.2027 1479.2643 1481.6397 1489.5432 1493.7194 1511.8605 1526.6459 1545.1989 1583.0626 1602.4268 1619.0114 2981.6694 2990.6411 2992.0183 3000.7323 3045.5740 3070.5784 3086.7898 3087.8606 3093.7399 3097.3001 3099.0610 3106.9765 3113.0381 3127.1306 3132.5225 3149.3507 3164.9857 3174.6540 3189.7236 3461.0510 3513.8231
redmass: 5.0699 4.9666 4.0559 4.4196 1.6848 2.5068 3.4949 4.0364 4.3918 3.8279 1.0996 2.6381 4.1594 3.1495 4.3026 1.5127 3.3893 4.5380 4.9589 2.0775 3.6132 3.4619 3.5553 3.6177 3.5987 3.5399 4.8069 3.3583 3.0278 1.1644 3.6356 5.0957 4.6723 6.6135 4.6037 4.6988 3.5801 4.2090 1.2069 4.9033 4.9184 5.8809 4.8494 5.3818 5.4119 6.0117 4.4804 2.9671 1.9036 5.9916 3.9966 4.8379 6.5787 1.6683 2.7038 1.5152 4.7306 3.7568 2.3229 1.9173 1.5469 2.9398 2.4290 4.0856 1.3310 1.5551 2.0774 3.5605 3.2151 1.6267 2.3783 1.3553 1.7331 1.7948 1.4545 1.5583 1.4683 1.4883 3.3951 1.4003 2.0484 1.9090 1.7520 1.9462 2.1590 3.0973 3.9675 1.8383 2.3988 3.8075 1.4130 2.3227 1.2922 1.3552 1.2403 6.9092 1.9264 1.3100 1.4807 1.3216 1.0591 2.7414 1.0513 1.0769 1.2970 1.9426 1.0587 1.1200 1.1255 6.5477 9.0472 7.4688 8.2266 6.7085 1.0317 1.0361 1.0339 1.0363 1.0828 1.0873 1.0988 1.1023 1.1001 1.1001 1.0989 1.1005 1.1003 1.1050 1.0862 1.0897 1.0951 1.0980 1.0923 1.0646 1.0652
irintensity: 1.2358 0.9920 0.9355 1.0190 2.6439 0.8261 0.8361 1.4413 6.4397 1.6256 0.0992 6.9520 2.0651 0.6536 4.5115 1.3412 1.0569 4.5679 3.3335 6.7225 2.2319 7.4867 15.5673 2.2235 4.4894 1.0213 0.8069 2.6550 1.1212 41.7006 1.6706 7.5312 10.1606 8.7392 13.7492 7.1254 6.2514 6.7939 230.5983 6.6907 5.7215 5.0377 17.6736 23.0182 5.0773 8.4787 4.0163 13.5595 87.3796 2.1993 4.0884 20.9103 0.2722 20.6856 44.6494 1.0996 9.6762 17.3595 22.9913 9.3786 13.1755 34.9286 20.6430 71.3074 0.6241 7.8637 35.2935 186.7108 35.0265 39.7921 149.5773 43.9263 28.8549 71.0868 2.2169 16.9276 29.4406 15.7880 59.7230 72.3208 45.0430 10.8715 39.2557 7.0154 10.8709 16.4059 93.8249 11.8397 2.1298 39.7163 72.5465 69.1248 45.5228 51.5343 34.2785 24.9225 4.9653 22.3821 43.6751 10.5654 4.1762 87.9182 3.7667 13.4433 81.0554 96.5672 14.2939 24.9903 42.6530 158.7217 321.1176 95.1042 387.0233 111.5474 71.6665 14.4702 39.6241 21.4297 26.0363 30.1388 19.6691 9.7523 41.6489 19.7462 26.2499 17.7851 15.4646 8.0721 6.1619 7.5323 19.2684 22.3242 0.1433 33.7484 9.3223
temp: 298.150 k
press: 1.00000 atm
elementType: 8 8 8 8 8 7 6 6 6 6 6 6 6 6 6 6 6 6 6 6 6 6 6 6 6 6 1 1 1 1 1 1 1 1 1 1 1 1 1 1 1 1 1 1 1 1 1
symmnumber: 1
zpe: 976947.2 jmol-1
zpe.correction: 0.372100 hartree
zpe.thermalcorrener: 0.395530 hartree
zpe.thermalcorrenthalpy: 0.396475 hartree
zpe.thermalcorrgfe: 0.321581 hartree
zpe.sumelectzpe: -1203.693465 hartree
zpe.sumelectthermal: -1203.670034 hartree
zpe.sumelectthermalent: -1203.669090 hartree
zpe.sumelectthermalfe: -1203.743984 hartree
dipole: 3.0938 -3.2168 4.3810
dipole: 6.2540
quadrupole: -136.7623 -152.6147 -152.2870
quadrupole: 5.5078 1.7855 -0.9159
quadrupole: 10.4590 -5.3934 -5.0657 5.5078 1.7855 -0.9159
hfenergy: -1204.0655645 hartree
pointgroup: C01 [X(C20H21N1O5)]
dipole: -1.1251458 -1.3117944 -1.7514102 debye
polarizability: 363.0396151|-9.1183819|274.295589|14.3205512|17.4631305|146.2996021 unknown
InChI: InChI=1S/C20H21NO5/c1-20(2)19(24)18(23)15-13(26-20)9-12(25-4)14-16(15)21(3)11-8-6-5-7-10(11)17(14)22/h5-9,18-19,23-24H,1-4H3
charge 0 multiplicity 1
47 atoms
O  -3.540969 0.73829 0.120407
O  -3.252898 -1.402197 1.94073
O  -1.114188 -2.601207 0.761052
O  0.087722 3.694379 0.095851
O  2.607439 2.403839 0.830637
N  0.989087 -1.107058 -0.737216
C  -4.203876 -0.577381 -0.21287
C  -3.347067 -1.653778 0.488874
C  -1.914867 -1.722475 -0.10348
C  -1.305649 -0.317419 -0.247766
C  -2.140588 0.819323 -0.04916
C  0.107641 -0.068174 -0.361508
C  -5.609919 -0.457195 0.385363
C  -4.250225 -0.748511 -1.7436
C  0.668151 1.237972 -0.068317
C  -1.636422 2.128031 0.01759
C  -0.249015 2.349066 0.014719
C  2.350853 -1.073439 -0.378442
C  2.092885 1.347491 0.315687
C  2.910728 0.121338 0.163817
C  0.534848 -2.184392 -1.641876
C  3.184233 -2.22087 -0.533044
C  4.277808 0.148922 0.543998
C  4.53693 -2.167523 -0.155974
C  5.096813 -0.979031 0.383406
C  1.207616 4.255405 -0.68693
H  -3.813506 -2.64969 0.410475
H  -1.973327 -2.266536 -1.060064
H  -5.573515 -0.417467 1.486123
H  -6.095624 0.459712 0.010895
H  -6.223542 -1.32645 0.089109
H  -3.254009 -0.630918 -2.203095
H  -4.644636 -1.746398 -2.009774
H  -4.917471 0.014032 -2.179815
H  -2.317124 2.979047 0.081214
H  -3.166744 -0.421289 2.081218
H  -1.364288 -2.359166 1.696026
H  0.213492 -3.082657 -1.086579
H  1.358722 -2.441735 -2.327594
H  -0.295534 -1.806474 -2.257589
H  2.770694 -3.164415 -0.897658
H  4.657617 1.088045 0.959261
H  5.157723 -3.063827 -0.266818
H  6.151279 -0.948495 0.675673
H  1.336999 3.699087 -1.634473
H  2.13302 4.20141 -0.095114
H  0.907303 5.295172 -0.892663
