program: Gaussian 09
title: 000183884
version: EM64L-G09RevD.01
frameworkgroup: C1[X(C13H6Cl6O2)]
method: RPBEPBE
basis: SDD
operation: Freq
keyword: #p
keyword: freq=noraman
keyword: PBEPBE/SDD
title: #p freq=noraman PBEPBE/SDD
converged: YES YES NO NO
title: Mulliken charges:
elementType: Cl Cl Cl Cl Cl Cl O O C C C C C C C C C C C C C H H H H H H
charge: 0.059697 0.058223 0.057592 0.062203 0.026129 -0.005368 -0.285979 -0.250298 0.366085 0.382342 -0.296240 -0.308501 0.514552 -0.135536 -0.117875 -0.307485 -0.314371 -0.060053 -0.210383 -0.245678 -0.498473 0.267973 0.241990 0.264112 0.253276 0.237470 0.244598
chargesum: 0.00000
title: Mulliken charges with hydrogens summed into heavy atoms:
elementType: Cl Cl Cl Cl Cl Cl O O C C C C C C C C C C C C C
charge: 0.059697 0.058223 0.057592 0.062203 0.026129 -0.005368 -0.285979 -0.250298 0.366085 0.382342 -0.296240 -0.308501 0.514552 -0.135536 -0.117875 -0.307485 -0.046398 -0.060053 0.031606 0.018434 0.236871
polarizability: 2.95136843e+02 -2.53140905e-01 1.90300242e+02 1.60398571e+01 -2.29470012e+00 1.50062838e+02
1716.lowfreq: -4.6357 -1.9002 0.0017 0.0023 0.0027 4.7944 15.4368 20.0931 31.9180
frequency: 15.3155 20.0589 31.9096 45.9911 69.4030 75.2972 78.0349 97.0301 126.8037 144.3560 178.7262 190.8908 195.3015 198.3774 205.1582 209.9251 211.0932 234.0160 301.9536 303.1508 319.5906 326.8478 332.2031 352.9599 381.1466 418.0523 434.3873 451.0642 500.1692 535.8303 541.9158 557.8343 620.7823 629.5743 665.6386 695.6829 711.2447 717.3988 728.1627 773.9424 786.2354 827.6718 851.8344 879.7011 940.7609 964.4074 984.1125 1022.2288 1086.9512 1105.3597 1128.6920 1155.5816 1164.6465 1191.0185 1222.2514 1255.9866 1329.0905 1352.9925 1368.2063 1380.5067 1421.8126 1430.7910 1446.7224 1451.8977 1466.2312 1525.7609 1553.8424 1575.8170 1588.6104 3006.0178 3120.1828 3135.7965 3153.1692 3170.0144 3185.8894
redmass: 14.3660 9.2515 9.3033 2.4630 7.2535 20.9942 16.1341 4.3429 11.2274 1.8583 4.9232 25.6901 4.4045 23.1128 11.7732 27.7727 10.9182 6.7851 7.6808 14.2531 17.7634 15.2531 19.4591 10.0717 9.0682 10.0986 9.6136 9.8240 4.2060 9.6738 5.0133 10.2096 11.5836 11.8479 10.7977 3.3436 7.4714 10.8100 11.0361 1.4672 11.0278 9.7928 9.7408 1.3839 11.8287 1.3245 10.5776 7.4836 2.0310 1.2521 2.1235 1.7207 2.1029 1.5591 2.7044 9.9315 11.4832 8.9327 7.4909 7.4742 2.8149 2.4755 1.3489 1.0660 1.0534 11.1728 10.1599 7.2577 7.6399 1.0287 1.1054 1.1058 1.0871 1.0933 1.0983
irintensity: 0.0781 1.0790 1.0696 6.0899 0.5016 0.0906 0.0686 0.6095 0.0956 4.6687 0.7866 0.1310 0.2273 0.2998 1.9776 0.1458 0.9853 4.0672 1.9339 0.3530 0.5121 0.4336 0.5112 4.4915 0.7200 2.5441 3.3235 3.8507 0.0105 11.3773 1.8414 7.3970 3.1428 10.0695 6.0365 3.1072 12.3164 71.6793 14.0064 64.2355 8.5921 84.6944 7.7378 0.1726 132.4468 0.2655 103.6908 42.4692 3.9875 1.7447 10.1346 4.3886 15.6697 15.8048 118.1845 8.6436 91.9686 116.2050 192.7041 253.3823 41.0912 153.5220 25.6754 19.4244 17.0237 6.2913 10.5059 4.1085 114.1593 42.8825 21.8897 17.1925 4.2529 1.8714 2.6181
temp: 298.150 k
press: 1.00000 atm
elementType: 17 17 17 17 17 17 8 8 6 6 6 6 6 6 6 6 6 6 6 6 6 1 1 1 1 1 1
symmnumber: 1
zpe: 405881.0 jmol-1
zpe.correction: 0.154592 hartree
zpe.thermalcorrener: 0.175771 hartree
zpe.thermalcorrenthalpy: 0.176716 hartree
zpe.thermalcorrgfe: 0.100473 hartree
zpe.sumelectzpe: -3408.231576 hartree
zpe.sumelectthermal: -3408.210396 hartree
zpe.sumelectthermalent: -3408.209452 hartree
zpe.sumelectthermalfe: -3408.285695 hartree
dipole: -0.7291 1.0792 1.4099
dipole: 1.9194
quadrupole: -173.2547 -161.9037 -152.2193
quadrupole: -2.4426 -7.3197 -6.4957
quadrupole: -10.7955 0.5556 10.2399 -2.4426 -7.3197 -6.4957
hfenergy: -3408.3861677 hartree
pointgroup: C01 [X(C13H6Cl6O2)]
dipole: -0.3055925 -0.3695312 -0.5833459 debye
polarizability: 290.9336524|10.1628235|191.1356977|-26.8262791|0.9891215|153.4305726 unknown
InChI: InChI=1S/C13H6Cl6O2/c1-20-12-10(18)8(16)9(17)11(19)13(12)21-6-4-2-3-5(14)7(6)15/h2-4H,1H3
charge 0 multiplicity 1
27 atoms
Cl 0.522273 2.668388 1.213345
Cl 3.863819 -2.395228 -0.862782
Cl 3.621831 3.055098 0.328216
Cl 5.2784 0.507697 -0.752034
Cl -3.043036 -0.601467 2.287492
Cl -5.608064 -0.246203 0.27644
O  -0.459426 -0.148763 0.983854
O  1.067266 -2.403779 -0.012248
C  0.872867 0.007363 0.547311
C  1.600895 -1.134377 0.111402
C  1.494462 1.274505 0.624542
C  2.953302 -0.954945 -0.293785
C  -1.508365 0.024415 0.04896
C  2.84021 1.438625 0.232907
C  3.565522 0.316006 -0.240259
C  -2.820352 -0.167165 0.551704
C  -1.298784 0.357688 -1.305559
C  -3.915956 -0.012461 -0.323058
C  -2.410433 0.506205 -2.161161
C  -3.723662 0.324459 -1.679329
C  0.143843 -2.933478 1.026099
H  -0.282191 0.500824 -1.68246
H  -2.252439 0.766001 -3.212185
H  -4.589334 0.438799 -2.336465
H  -0.897793 -2.659725 0.798897
H  0.420065 -2.559695 2.026158
H  0.276577 -4.024185 0.968399
