program: Gaussian 09
title: 000183848
version: EM64L-G09RevD.01
frameworkgroup: C1[X(C14H22N2O)]
method: RPBEPBE
basis: SDD
operation: Freq
keyword: #p
keyword: freq=noraman
keyword: PBEPBE/SDD
title: #p freq=noraman PBEPBE/SDD
converged: YES YES NO NO
title: Mulliken charges:
elementType: O N N C C C C C C C C C C C C C C H H H H H H H H H H H H H H H H H H H H H H
charge: -0.319788 -0.505152 -0.165992 -0.557611 -0.365407 0.401920 0.333277 -0.341105 -0.421727 -0.553292 0.487728 -0.496334 -0.853286 -0.697295 0.298576 -0.632262 -0.670948 0.200547 0.204458 0.200531 0.204228 0.195008 0.193784 0.231337 0.311882 0.209922 0.227783 0.226486 0.243148 0.215107 0.211323 0.211103 0.320246 0.222402 0.222432 0.289669 0.234762 0.247225 0.235313
chargesum: 0.00000
title: Mulliken charges with hydrogens summed into heavy atoms:
elementType: O N N C C C C C C C C C C C C C C
charge: -0.319788 -0.184906 -0.165992 -0.152605 0.039353 0.401920 0.333277 0.047687 -0.190390 -0.241410 0.487728 -0.286411 -0.155868 -0.059763 0.298576 0.102241 0.046352
polarizability: 2.67424078e+02 -3.77816598e+00 1.64566489e+02 1.19214378e+01 1.79045118e+00 1.08795509e+02
1716.lowfreq: -0.0006 -0.0004 0.0002 0.8452 5.7979 9.5323 26.3285 30.8767 41.2283
frequency: 25.8096 30.6827 40.7976 70.2279 75.6956 83.7775 106.8120 110.1811 119.5141 136.8927 152.6880 172.1256 202.3227 207.8347 231.1048 236.8966 245.4291 295.6666 309.7330 353.1446 376.1473 417.3256 425.3229 445.4858 465.5069 532.1742 551.4696 581.2960 598.4636 620.3634 702.7084 728.3692 733.3660 743.3548 784.9933 790.1684 814.6844 851.8346 896.5588 917.4274 928.5572 935.7833 948.9660 997.9516 1006.7000 1017.7739 1044.6562 1059.0391 1063.1837 1067.3837 1094.8130 1104.9907 1131.2016 1135.7701 1156.4131 1189.5183 1205.1181 1214.9017 1252.2606 1257.1608 1264.2142 1280.5695 1283.1467 1290.9363 1322.0505 1344.4458 1345.5106 1381.8558 1392.8227 1396.8977 1412.3785 1418.4091 1448.3557 1464.3593 1466.4623 1471.5167 1476.4718 1478.3428 1480.2098 1481.8584 1483.1653 1490.0204 1494.1394 1496.7958 1498.7466 1517.8194 1591.2389 1622.1035 1627.3150 2935.4187 2962.4033 2963.1160 2970.2906 2972.1210 2973.0607 2979.6680 3001.1582 3002.0202 3019.0361 3035.8148 3044.4924 3046.3623 3070.0130 3070.7542 3088.0425 3096.3179 3097.7224 3115.2231 3125.8278 3178.9184 3549.7308
redmass: 3.2335 3.9918 3.4975 2.8749 1.6360 2.0205 3.3939 1.1509 2.0462 2.1749 2.1342 1.3644 3.7568 2.3773 1.1448 2.8429 3.2159 3.3105 2.6707 3.9417 3.9845 3.0087 3.0379 3.0623 3.1060 4.1854 1.3236 4.4717 3.1105 4.6398 11.2941 1.2985 2.5467 4.0018 3.7286 1.2136 1.5686 5.6587 1.7288 1.2746 1.3419 1.3952 3.3537 1.9558 3.8318 1.9459 1.5642 1.4152 1.4480 2.5276 1.2353 2.1820 1.9422 1.3278 1.7521 1.9295 1.5194 1.7953 1.3639 3.4789 1.7602 1.6478 1.1041 1.3928 1.4369 2.6578 1.7214 4.8429 1.2146 1.2992 3.0529 1.1879 1.1956 1.1013 1.1598 1.0696 1.1063 1.0431 1.0543 1.0978 1.1028 1.1122 1.0472 1.2002 1.8111 2.4138 6.0285 4.0454 6.6320 1.0384 1.0584 1.0367 1.0579 1.0390 1.0373 1.0596 1.0983 1.1017 1.1016 1.1024 1.1024 1.0982 1.1003 1.0997 1.0980 1.0939 1.0871 1.0961 1.0962 1.0923 1.0752
irintensity: 2.7214 0.0266 0.3539 2.2088 3.2172 3.3670 3.0620 0.6686 0.9534 0.2547 0.0426 0.1512 0.5367 0.1657 0.3142 4.4549 6.3468 0.4701 0.1402 1.4382 22.2241 1.5729 2.3186 1.9427 6.4226 3.7218 62.6192 2.1865 2.4931 0.9653 21.4769 5.9581 1.8183 2.6901 4.2373 0.9934 44.3306 4.5144 5.0463 1.5112 20.0540 0.7080 4.7199 55.3809 0.3507 9.6760 12.1903 20.4992 0.8085 1.7600 0.0816 26.8219 15.7395 0.2785 139.0776 92.6039 7.1699 29.4885 7.0030 15.6620 5.0544 26.5672 2.2761 14.3159 3.0821 69.2339 7.5922 91.6102 11.6369 20.7394 168.2348 31.2518 41.4737 15.5529 27.6313 1.0982 15.5647 10.6967 23.7254 41.1015 1.3724 20.1940 8.1677 195.9282 22.8903 462.9427 84.5305 212.0918 75.7997 56.3717 22.4748 115.1331 1.5030 26.7292 42.4479 100.6948 3.5055 41.7855 0.8772 46.6847 40.8380 30.5753 77.6314 67.6541 19.6330 26.3140 18.9317 0.8851 26.5290 6.2038 9.6667
temp: 298.150 k
press: 1.00000 atm
elementType: 8 7 7 6 6 6 6 6 6 6 6 6 6 6 6 6 6 1 1 1 1 1 1 1 1 1 1 1 1 1 1 1 1 1 1 1 1 1 1
symmnumber: 1
zpe: 879352.0 jmol-1
zpe.correction: 0.334927 hartree
zpe.thermalcorrener: 0.354446 hartree
zpe.thermalcorrenthalpy: 0.355390 hartree
zpe.thermalcorrgfe: 0.285486 hartree
zpe.sumelectzpe: -730.128866 hartree
zpe.sumelectthermal: -730.109348 hartree
zpe.sumelectthermalent: -730.108404 hartree
zpe.sumelectthermalfe: -730.178307 hartree
dipole: 1.8905 -3.6508 0.1717
dipole: 4.1148
quadrupole: -78.1506 -99.8808 -108.1131
quadrupole: -14.0653 3.3185 -0.5635
quadrupole: 17.2309 -4.4993 -12.7316 -14.0653 3.3185 -0.5635
hfenergy: -730.4637937 hartree
pointgroup: C01 [X(C14H22N2O1)]
dipole: -0.7435461 1.407779 0.2934894 debye
polarizability: 267.8671594|-2.373337|163.5862896|-8.9190823|7.6208066|109.3326268 unknown
InChI: InChI=1S/C14H22N2O/c1-5-6-7-12-8-9-13(10-11(12)2)15-14(17)16(3)4/h8-10,15H,5-7H2,1-4H3
charge 0 multiplicity 1
39 atoms
O  -3.090604 -1.634934 -0.146803
N  -2.38318 0.610707 0.00399
N  -4.662984 0.053987 0.259335
C  3.362205 0.334587 -0.795534
C  4.121701 0.087868 0.53968
C  1.849457 0.358045 -0.626854
C  1.05994 -0.831615 -0.66876
C  5.655541 0.046322 0.357365
C  1.189895 1.58811 -0.38228
C  -0.339126 -0.76647 -0.461916
C  -0.98162 0.473298 -0.211791
C  -0.200593 1.65856 -0.175295
C  1.691612 -2.186492 -0.950501
C  6.410303 -0.196005 1.682552
C  -3.355268 -0.402838 0.026543
C  -5.745771 -0.939708 0.320731
C  -5.005583 1.469695 0.450769
H  3.662535 -0.448068 -1.51954
H  3.705232 1.300429 -1.216891
H  3.77659 -0.863777 0.99196
H  3.853027 0.886507 1.260367
H  5.914497 -0.751081 -0.369302
H  5.994922 1.000623 -0.095591
H  1.78079 2.512294 -0.355972
H  -0.947887 -1.67235 -0.492858
H  -0.679257 2.629818 0.009509
H  2.152495 -2.21757 -1.956859
H  2.489771 -2.428749 -0.224121
H  0.937251 -2.989297 -0.903187
H  7.504787 -0.222548 1.527712
H  6.109383 -1.158056 2.138488
H  6.191412 0.603667 2.415211
H  -2.691752 1.569303 0.168263
H  -6.506086 -0.749151 -0.461409
H  -6.241302 -0.928426 1.310995
H  -5.302623 -1.933134 0.153642
H  -4.531492 1.90215 1.356824
H  -6.095465 1.557721 0.583698
H  -4.735351 2.090379 -0.428668
