program: Gaussian 09
title: 000183853
version: EM64L-G09RevD.01
frameworkgroup: C1[X(C19H27ClN2O3)]
method: RPBEPBE
basis: SDD
operation: Freq
keyword: #p
keyword: freq=noraman
keyword: PBEPBE/SDD
title: #p freq=noraman PBEPBE/SDD
converged: YES YES NO NO
title: Mulliken charges:
elementType: Cl O O O N N C C C C C C C C C C C C C C C C C C C H H H H H H H H H H H H H H H H H H H H H H H H H H H
charge: -0.014494 -0.310317 -0.231811 -0.307933 -0.504218 -0.162770 0.371795 0.371163 -0.559327 -0.582828 0.006426 -0.785006 -0.785522 -0.784859 -0.786577 0.169887 0.343928 -0.277877 -0.319467 -0.475346 -0.345892 0.517456 0.306743 -0.630023 -0.670424 0.235548 0.225988 0.215764 0.242648 0.256574 0.212713 0.229067 0.210260 0.220056 0.209949 0.237422 0.210586 0.209802 0.231530 0.224254 0.226644 0.210542 0.270113 0.245731 0.316800 0.328891 0.290311 0.227798 0.228097 0.239117 0.252407 0.238684
chargesum: 0.00000
title: Mulliken charges with hydrogens summed into heavy atoms:
elementType: Cl O O O N N C C C C C C C C C C C C C C C C C C C
charge: -0.014494 -0.310317 -0.231811 -0.307933 -0.175327 -0.162770 0.371795 0.371163 -0.097791 -0.124416 0.262999 -0.132966 -0.118095 -0.132941 -0.125137 0.169887 0.343928 -0.277877 -0.049354 -0.229615 -0.029092 0.517456 0.306743 0.116183 0.059784
polarizability: 3.70644703e+02 -2.23749339e+01 2.53311713e+02 3.98699567e+00 3.57815970e+00 1.55411545e+02
1716.lowfreq: -12.3763 -0.0025 -0.0024 -0.0023 2.6092 4.5505 11.5313 22.0206 25.8149
frequency: -2.9289 21.9205 25.7591 35.5544 41.2181 51.7057 68.0954 85.0055 100.2778 115.0586 124.9485 146.1766 158.5420 163.6645 190.8305 200.7842 205.7462 213.0149 220.7870 230.2592 238.7462 257.8227 261.7206 273.5440 302.7286 307.2556 325.0913 344.7239 350.9954 356.6053 362.8165 382.8271 397.4332 425.7685 426.3408 447.6573 459.3661 471.6471 483.3312 519.1818 555.9709 557.5439 600.7338 604.1987 618.4675 646.2608 673.2214 678.6214 700.9112 705.4271 748.2766 777.6303 799.6673 827.0010 853.5415 856.8045 857.2873 874.8276 881.6704 899.0456 915.2069 934.2674 937.5861 956.0694 965.5422 976.6496 1002.5340 1004.4774 1005.9728 1010.8176 1014.9644 1061.4179 1061.7956 1065.5399 1095.2295 1114.9060 1130.1402 1136.5659 1150.8165 1152.9637 1158.4671 1200.3475 1205.9587 1223.0212 1229.6743 1235.9851 1244.1106 1257.0787 1265.9876 1271.9744 1297.5834 1298.4323 1313.9162 1331.6934 1341.6665 1361.3166 1373.8818 1379.4834 1390.0558 1401.7430 1410.7367 1421.0078 1448.8804 1453.8176 1461.7465 1466.0504 1470.0765 1472.3839 1476.5759 1476.8905 1483.4450 1485.4023 1487.0179 1488.9134 1494.1599 1494.9474 1495.0302 1498.1274 1503.4037 1571.0413 1617.4936 1620.1495 1632.6386 2942.4772 2969.2638 2969.9904 2970.9815 2975.0837 2978.0281 3005.6446 3009.8772 3012.5357 3045.6648 3050.6595 3054.6078 3055.8849 3062.4339 3064.9697 3068.0032 3069.8444 3076.6354 3077.6870 3079.4501 3082.7708 3102.1615 3120.5059 3137.0939 3178.8608 3204.6742 3546.6546
redmass: 4.2352 4.0207 3.7726 3.9879 7.4157 4.3430 4.4809 1.8205 4.1410 4.5905 2.0386 3.3625 4.1538 1.2523 3.5308 2.0927 1.4015 1.3720 3.2892 3.1885 2.4813 3.8842 1.1447 2.1912 2.6354 1.7560 3.5270 4.1392 3.0109 2.2194 2.3954 3.4836 2.7058 3.1539 3.2356 3.0192 2.4554 2.5966 3.3980 4.9981 2.6792 2.0059 4.4965 2.7965 3.7512 5.3362 3.8524 3.9714 5.8655 10.1277 4.3827 4.5748 3.7180 2.9196 2.6562 1.8287 3.3263 1.5191 5.4233 2.0372 1.8502 1.3973 1.4064 1.8480 1.5184 2.2455 1.3745 1.3138 4.6533 2.7038 1.5613 1.4248 2.2124 2.5068 1.2317 1.9100 1.4793 1.3333 1.8463 1.8805 2.0837 2.2959 1.9810 2.1826 2.9723 2.2214 1.7838 3.3456 1.7006 2.1649 1.8931 1.7747 1.5844 2.9930 1.3295 3.5825 1.2155 1.2018 1.2122 1.2006 5.9664 1.1515 1.1805 1.0668 1.0487 1.0508 1.0747 1.0671 1.2528 1.1155 1.0826 1.0517 1.8491 1.0560 1.3558 1.0578 1.0459 1.0581 2.0288 4.1877 6.4711 10.4408 4.8042 1.0386 1.0357 1.0365 1.0361 1.0359 1.0360 1.0620 1.0610 1.1019 1.1026 1.0910 1.0988 1.0989 1.0994 1.0991 1.1006 1.0987 1.0984 1.0987 1.0982 1.0987 1.0943 1.0967 1.0921 1.0896 1.0956 1.0753
irintensity: 0.1876 0.9088 3.2631 0.5360 1.6665 0.1492 1.4044 7.4982 0.6675 2.1332 0.9193 0.9470 0.8892 0.2625 0.0888 1.6441 1.3105 0.5885 0.2335 3.3706 3.4608 0.5232 0.8889 2.5551 1.5618 0.3270 6.4891 5.9552 2.0883 0.2232 0.6381 15.5403 0.4380 2.9874 7.5660 7.8342 0.0800 7.8204 2.4022 8.7783 10.6328 29.2853 2.5660 20.8257 3.6235 2.3152 13.2991 11.6262 3.8789 19.8077 3.5779 3.6964 2.4696 6.5524 1.3800 10.2389 13.2877 58.1628 42.2804 6.9880 4.4339 0.8332 2.7418 11.5897 1.5940 19.7166 20.7396 0.1978 287.3388 9.3268 1.6293 15.9180 140.6021 284.7883 0.1440 0.8755 52.1549 0.4028 108.5068 10.4674 215.1921 19.1638 17.1171 9.1419 389.5201 4.3660 124.9035 9.0854 5.3150 3.3296 82.6496 11.3312 2.4828 13.8901 15.1356 264.2724 5.9130 26.6062 27.4662 14.7166 50.3195 34.0720 28.5884 1.7947 0.3789 2.5686 0.9204 5.9163 142.0380 95.1963 35.9804 20.8597 31.4630 19.5893 401.2434 0.6791 4.0413 2.4680 233.5753 115.6274 333.3913 78.1497 411.6705 49.5334 27.2797 107.3360 27.7846 48.2867 23.6291 27.0178 11.6347 36.0164 40.0297 0.6505 15.5045 14.1972 12.1384 51.3980 15.9895 61.0968 7.2776 93.6739 80.6327 19.8885 18.3139 0.7447 8.5800 2.8122 7.3013 22.5442
temp: 298.150 k
press: 1.00000 atm
elementType: 17 8 8 8 7 7 6 6 6 6 6 6 6 6 6 6 6 6 6 6 6 6 6 6 6 1 1 1 1 1 1 1 1 1 1 1 1 1 1 1 1 1 1 1 1 1 1 1 1 1 1 1
symmnumber: 1
zpe: 1126465.2 jmol-1
zpe.correction: 0.429048 hartree
zpe.thermalcorrener: 0.455208 hartree
zpe.thermalcorrenthalpy: 0.456152 hartree
zpe.thermalcorrgfe: 0.372074 hartree
zpe.sumelectzpe: -1533.574539 hartree
zpe.sumelectthermal: -1533.548380 hartree
zpe.sumelectthermalent: -1533.547435 hartree
zpe.sumelectthermalfe: -1533.631513 hartree
dipole: 5.3636 -1.4649 -0.2271
dipole: 5.5647
quadrupole: -88.0177 -173.7453 -159.0280
quadrupole: 10.1586 2.2978 -1.7497
quadrupole: 52.2460 -33.4817 -18.7643 10.1586 2.2978 -1.7497
hfenergy: -1534.0035874 hartree
pointgroup: C01 [X(C19H27Cl1N2O3)]
dipole: 2.1174478 0.5367211 0.1467688 debye
polarizability: 371.3161285|20.7411331|251.6344092|-0.5780295|10.7872893|156.4174229 unknown
InChI: InChI=1S/C19H27ClN2O3/c1-18(2)10-13(11-19(18,3)4)25-16(23)14-8-7-12(9-15(14)20)21-17(24)22(5)6/h7-9,13,21H,10-11H2,1-6H3
charge 0 multiplicity 1
52 atoms
Cl 1.157249 -4.03558 -0.290036
O  -1.872518 -0.618289 0.440309
O  -1.561102 -2.768082 -0.41103
O  4.405359 2.189217 0.307105
N  4.500611 -0.156862 0.065664
N  6.484818 1.11714 0.183483
C  -4.611943 0.962294 -0.771424
C  -5.144021 0.86991 0.727187
C  -3.956761 -0.440513 -0.969085
C  -3.978872 0.117343 1.449938
C  -3.358183 -0.841237 0.405413
C  -5.720675 1.228889 -1.815608
C  -3.522339 2.061619 -0.921493
C  -5.429108 2.24158 1.382676
C  -6.439503 0.013814 0.82024
C  -1.0740 -1.679951 -0.020355
C  0.371158 -1.31033 0.023465
C  1.433401 -2.244737 -0.113894
C  0.749099 0.054957 0.186864
C  2.778381 -1.844213 -0.093479
C  2.083131 0.486767 0.202873
C  3.12336 -0.473189 0.06024
C  5.086496 1.123787 0.193648
C  7.187267 2.407423 0.288923
C  7.294071 -0.106851 0.077894
H  -3.184742 -0.439661 -1.758474
H  -4.717704 -1.186458 -1.266247
H  -4.330165 -0.418824 2.349358
H  -3.199921 0.82932 1.776949
H  -3.519837 -1.910685 0.620673
H  -5.284621 1.292964 -2.830578
H  -6.477667 0.425069 -1.829164
H  -6.239301 2.186543 -1.617432
H  -3.947699 3.073704 -0.794961
H  -3.078892 2.010268 -1.933737
H  -2.701304 1.935959 -0.193725
H  -5.813609 2.104082 2.411333
H  -6.195592 2.804886 0.816471
H  -4.522374 2.868263 1.449463
H  -7.297453 0.523999 0.346653
H  -6.325915 -0.975792 0.340818
H  -6.699136 -0.15809 1.881837
H  -0.054102 0.787074 0.299479
H  3.559602 -2.605842 -0.195495
H  2.340319 1.539744 0.320428
H  5.126277 -0.956127 -0.042735
H  6.43139 3.204515 0.350341
H  7.82506 2.582209 -0.598326
H  7.818789 2.440536 1.197181
H  7.093217 -0.814771 0.907737
H  8.358973 0.166103 0.139542
H  7.14813 -0.628894 -0.890399
