program: Gaussian 09
title: 000183860
version: EM64L-G09RevD.01
frameworkgroup: C1[X(C20H32O3)]
method: RPBEPBE
basis: SDD
operation: Freq
keyword: #pfreq=noraman
keyword: PBEPBE/SDD
title: #p freq=noraman PBEPBE/SDD
converged: YES YES NO NO
title: Mulliken charges:
elementType: O O O C C C C C C C C C C C C C C C C C C C C H H H H H H H H H H H H H H H H H H H H H H H H H H H H H H H H
charge: -0.431491 -0.438235 -0.434389 0.381351 -0.200033 0.459785 -0.070702 -0.258899 -0.615417 -0.555320 -0.270130 -0.358216 0.344947 -0.525918 -0.504061 -0.443549 0.573779 -0.920692 -0.486953 -0.444486 -0.466862 -0.847104 -0.830620 0.187918 0.162464 0.190291 0.199907 0.237048 0.208491 0.263066 0.231946 0.254155 0.232199 0.202822 0.208653 0.203889 0.211729 0.200966 0.265330 0.223101 0.210767 0.234560 0.198110 0.192454 0.203263 0.221171 0.206567 0.222423 0.220949 0.260667 0.330841 0.338829 0.245334 0.230491 0.342813
chargesum: 0.00000
title: Mulliken charges with hydrogens summed into heavy atoms:
elementType: O O O C C C C C C C C C C C C C C C C C C C C
charge: -0.100651 -0.099406 -0.091576 0.381351 -0.012114 0.459785 0.091762 -0.068608 -0.178461 -0.083763 -0.038183 -0.104061 0.344947 -0.090897 -0.091519 -0.030854 0.573779 -0.221494 -0.054283 -0.048769 -0.039123 -0.143064 -0.354795
polarizability: 2.55619072e+02 -2.81526742e+00 1.95425724e+02 -3.84127199e+00 -1.58477124e+00 1.86811047e+02
1716.lowfreq: -12.2722 0.0007 0.0007 0.0008 10.3081 20.1607 51.6971 68.6045 97.0603
frequency: 51.6258 68.5948 97.0216 105.0969 124.3169 143.9178 166.8594 178.7669 200.9850 216.3119 221.4518 240.2719 246.0455 253.6654 260.7852 272.0834 276.8471 297.0006 299.1265 304.4733 315.2116 326.7072 349.2457 352.2838 376.3111 385.2526 400.1215 405.5824 413.1059 423.6067 434.7500 468.8405 473.5913 499.4533 508.3779 550.9922 569.4331 584.2487 596.1560 609.2675 646.4162 675.5625 721.4619 728.9846 755.8762 777.2355 819.8659 835.2159 839.9861 848.0813 862.6969 877.1364 895.9736 902.1097 922.5760 928.8677 937.2873 940.4245 945.6912 955.4964 978.0453 981.7868 985.7082 996.8858 997.9318 1005.5956 1017.6899 1026.6781 1042.4930 1057.9167 1062.3825 1072.5330 1085.3546 1091.5003 1100.3919 1111.8497 1116.2794 1129.1282 1143.2443 1157.3489 1167.6072 1183.6193 1186.8314 1204.7644 1205.4644 1208.6833 1216.7580 1228.6097 1246.4543 1248.5847 1257.3249 1259.7570 1263.0166 1281.8973 1285.2128 1297.5215 1300.1879 1315.1160 1325.9903 1326.8419 1332.8684 1334.2762 1338.8063 1340.5605 1345.3771 1347.8916 1356.4243 1371.2225 1375.9612 1383.6023 1387.4604 1390.3400 1402.6127 1418.4350 1460.0930 1462.0877 1465.8450 1470.9852 1472.7110 1478.6178 1479.7903 1485.1481 1489.3406 1492.2182 1498.6894 1514.9775 1674.8065 2888.0748 2896.1095 2905.8371 2954.8030 2961.6841 2963.9934 2971.6616 2972.3789 2976.3946 2977.2938 2984.8349 2987.6635 3001.6942 3009.7607 3015.1591 3027.8187 3033.1909 3034.4655 3039.9415 3041.1953 3044.6222 3052.5392 3058.4971 3068.4518 3070.5339 3086.4382 3095.8978 3101.8633 3189.5483 3543.3105 3553.5623 3572.2071
redmass: 4.9240 3.8594 3.8931 3.3205 3.8155 3.8654 4.3071 3.2900 3.2418 2.4719 3.3173 2.6505 1.8146 1.9819 1.2270 1.9843 2.0413 2.4098 3.4371 2.5832 2.5855 1.6013 1.4741 1.7364 2.7764 1.9693 1.9045 1.7791 2.6139 2.3556 2.6724 3.0792 2.7375 2.8608 2.8957 2.9762 2.7788 3.3947 3.6413 3.0832 2.8956 2.4024 1.7755 1.9414 2.8226 2.7833 1.8847 2.2828 1.6893 2.6240 2.7545 2.2117 2.0065 2.0979 2.1779 1.8207 2.0085 1.4416 2.2339 1.9031 2.1810 3.3153 1.7374 2.6006 2.4725 2.2765 2.0701 2.3487 2.1651 1.8297 1.9735 1.7838 1.9511 1.8422 1.7856 1.6606 1.8888 1.7093 2.0647 1.8488 1.6265 1.5703 1.5569 1.4884 1.9004 1.8514 2.0033 1.5462 1.9958 1.7776 1.4724 1.5460 1.5586 1.4184 1.4629 1.3147 1.4416 1.4460 1.2962 1.3625 1.4150 1.3164 1.4326 1.4078 1.4327 1.3940 1.3745 1.2310 1.2467 1.5036 1.1634 1.2254 1.1985 1.1761 1.0782 1.0843 1.0774 1.0823 1.0818 1.0871 1.0767 1.0685 1.0765 1.0619 1.0524 1.0509 6.3125 1.0816 1.0823 1.0820 1.0655 1.0641 1.0591 1.0603 1.0390 1.0640 1.0606 1.0455 1.0588 1.0817 1.0601 1.0976 1.0929 1.0984 1.0926 1.1006 1.1024 1.1003 1.0987 1.0971 1.0947 1.0999 1.0615 1.0951 1.0995 1.1140 1.0656 1.0658 1.0659
irintensity: 0.8648 0.4619 0.7988 2.2728 1.9703 0.3320 2.2545 0.3075 0.5989 12.0966 1.2589 28.5902 1.7858 15.2806 102.6320 3.3355 1.9118 13.6879 14.3513 9.9587 22.2047 32.0480 122.6262 50.5373 7.3456 26.1930 31.1942 40.2253 4.8656 12.2159 1.6771 2.1235 9.7454 7.8566 7.1542 0.8472 3.3339 1.3885 1.3014 29.1918 0.8816 2.0566 1.1422 1.2747 3.1339 10.9426 0.8098 9.7175 4.3715 5.7552 4.8904 1.7530 10.9120 3.7710 16.3260 15.4088 9.5210 58.9619 18.5277 8.1817 1.7362 99.7888 22.4027 37.7352 37.9690 25.9052 6.8266 37.1649 23.0662 0.7892 1.3451 7.8233 1.5523 3.5273 2.1319 8.0603 21.6640 6.0029 10.8953 10.7428 9.0869 6.0439 5.3127 9.1372 3.3232 6.2419 6.8373 15.1505 0.2775 9.5750 5.6278 5.3504 5.6961 2.3376 5.5322 11.2622 3.1752 2.2717 9.3824 4.9280 0.8857 12.7490 5.6167 1.2126 3.8212 3.1220 6.4878 7.9792 11.3631 18.5605 10.7382 10.8164 26.8054 8.3912 3.9469 5.8175 3.7793 9.7737 8.3317 5.7400 4.9062 12.1661 4.2407 14.5973 11.3392 9.4007 20.5854 6.5749 4.0043 89.4455 55.4917 54.7794 36.7592 46.5230 27.8403 34.3446 6.9339 23.9639 41.9068 12.5530 30.4025 26.2167 35.9149 64.0948 46.1890 1.3263 48.4459 89.8927 37.1224 34.5917 57.7935 12.6335 7.9058 18.8464 13.0647 9.6230 2.1011 3.2188 7.7336
temp: 298.150 k
press: 1.00000 atm
elementType: 8 8 8 6 6 6 6 6 6 6 6 6 6 6 6 6 6 6 6 6 6 6 6 1 1 1 1 1 1 1 1 1 1 1 1 1 1 1 1 1 1 1 1 1 1 1 1 1 1 1 1 1 1 1 1
symmnumber: 1
zpe: 1272278.1 jmol-1
zpe.correction: 0.484585 hartree
zpe.thermalcorrener: 0.506720 hartree
zpe.thermalcorrenthalpy: 0.507664 hartree
zpe.thermalcorrgfe: 0.437598 hartree
zpe.sumelectzpe: -1005.129527 hartree
zpe.sumelectthermal: -1005.107392 hartree
zpe.sumelectthermalent: -1005.106448 hartree
zpe.sumelectthermalfe: -1005.176514 hartree
dipole: -2.2913 2.0022 -1.6605
dipole: 3.4664
quadrupole: -150.6530 -144.0151 -139.6416
quadrupole: -4.7423 11.7470 4.9522
quadrupole: -5.8831 0.7548 5.1283 -4.7423 11.7470 4.9522
hfenergy: -1005.614112 hartree
pointgroup: C01 [X(C20H32O3)]
dipole: 0.9015638 -0.7988895 -0.6394499 debye
polarizability: 255.6494841|-2.6056739|195.4751068|3.7220383|1.423593|186.7312517 unknown
InChI: InChI=1S/C20H32O3/c1-12-13-5-6-14-19(3)8-4-7-18(2,11-21)15(19)9-16(22)20(14,10-13)17(12)23/h13-17,21-23H,1,4-11H2,2-3H3
charge 0 multiplicity 1
55 atoms
O  0.876158 3.079228 -0.738865
O  1.850766 0.865141 2.053865
O  -5.348743 0.976863 -0.497434
C  1.432527 0.621819 -0.534294
C  0.749034 -0.804286 -0.504154
C  -0.65215 -0.969325 0.226584
C  -1.569438 0.224235 -0.233271
C  0.36568 1.698445 -0.87381
C  2.538954 0.553345 -1.641447
C  -0.883241 1.592338 0.005199
C  3.626966 -0.324181 -0.970827
C  2.35579 1.013957 0.686076
C  -3.063335 0.172154 0.277733
C  1.787345 -1.892263 -0.107735
C  -1.292906 -2.322499 -0.280463
C  3.105816 -1.792126 -0.917851
C  3.67804 0.269887 0.43615
C  -0.531102 -1.042672 1.774381
C  -3.545095 -1.306647 0.426939
C  -2.819949 -2.242303 -0.560479
C  -3.923784 0.84883 -0.838518
C  -3.295312 0.932988 1.610245
C  4.673039 0.140182 1.345971
H  0.499759 -0.990255 -1.575579
H  -1.637129 0.108332 -1.342389
H  0.061275 1.534036 -1.935576
H  2.944145 1.562205 -1.86642
H  2.157638 0.121428 -2.585137
H  -1.5593 2.424919 -0.263797
H  -0.596161 1.731099 1.062497
H  4.603835 -0.286013 -1.485086
H  2.50406 2.108532 0.604167
H  1.347213 -2.898507 -0.24004
H  2.038845 -1.805805 0.967458
H  -1.105232 -3.107503 0.478087
H  -0.784105 -2.660004 -1.205759
H  3.871861 -2.446679 -0.45976
H  2.945885 -2.146986 -1.956337
H  -0.235461 -0.079304 2.2194
H  -1.486376 -1.357866 2.224855
H  0.213762 -1.806431 2.068392
H  -4.639582 -1.330338 0.261612
H  -3.379159 -1.661588 1.462163
H  -2.996403 -1.882559 -1.594546
H  -3.256005 -3.258868 -0.515324
H  -3.924197 0.221412 -1.74745
H  -3.499955 1.842647 -1.098254
H  -3.159435 2.025769 1.497401
H  -4.321827 0.747681 1.981062
H  -2.602187 0.594673 2.397226
H  1.555205 3.240753 -1.442322
H  1.968653 -0.079065 2.331255
H  4.595854 0.598252 2.339091
H  5.592063 -0.412799 1.118872
H  -5.443695 1.639927 0.231348
