program: Gaussian 09
title: 000183830
version: EM64L-G09RevD.01
frameworkgroup: C1[X(C14H9F3N2O2S)]
method: RPBEPBE
basis: SDD
operation: Freq
keyword: #p
keyword: freq=noraman
keyword: PBEPBE/SDD
title: #p freq=noraman PBEPBE/SDD
converged: YES YES NO NO
title: Mulliken charges:
elementType: S F F F O O N N C C C C C C C C C C C C C C H H H H H H H H H
charge: 0.914035 -0.162808 -0.163490 -0.166478 -0.517973 -0.495170 -0.564734 0.003838 -0.014756 0.416850 0.307704 -0.297153 -0.353908 -0.384794 -0.230259 -0.366649 -0.288205 0.404562 -0.184635 0.266957 -0.355106 -0.241178 0.308427 0.252323 0.241926 0.318212 0.289979 0.270980 0.265192 0.255461 0.270850
chargesum: 0.00000
title: Mulliken charges with hydrogens summed into heavy atoms:
elementType: S F F F O O N N C C C C C C C C C C C C C C
charge: 0.914035 -0.162808 -0.163490 -0.166478 -0.517973 -0.495170 -0.256307 0.003838 -0.014756 0.416850 0.307704 -0.044830 -0.111981 -0.066582 0.059720 -0.095668 -0.023013 0.404562 0.070825 0.266957 -0.084256 -0.241178
polarizability: 2.85713722e+02 -2.37871517e+00 2.30309399e+02 1.38777879e+01 1.33746717e+01 1.27731587e+02
1716.lowfreq: -9.6422 -4.0204 0.0004 0.0013 0.0015 4.5525 8.3884 11.5363 20.0762
frequency: 2.5059 10.9390 20.0631 29.1116 47.4165 81.4388 95.0793 105.2399 139.9810 159.4219 172.2213 174.8584 191.1333 205.8730 241.7969 270.7221 308.8227 336.7371 346.8658 373.0001 382.4857 386.8117 402.9489 418.5667 437.8636 454.3809 477.8931 487.6256 517.6156 554.3820 564.1131 585.6020 604.8586 629.4135 653.9105 682.3836 690.5751 736.3161 786.9541 808.5957 813.7334 818.5630 830.1569 842.4843 859.2475 938.6876 943.8967 950.8408 958.1755 974.8217 979.3816 986.5853 988.9891 1001.9858 1018.5742 1030.7863 1061.3943 1091.3156 1129.3395 1182.9326 1188.6797 1195.7591 1234.9579 1241.9356 1283.0148 1289.2755 1319.6656 1367.2925 1395.8875 1421.9571 1423.1327 1459.2292 1496.1031 1559.7862 1579.0355 1607.9576 1615.5828 2186.8868 3138.1474 3155.2944 3157.7230 3159.1116 3165.9933 3166.8742 3179.5651 3181.4665 3354.8289
redmass: 7.5583 12.7526 7.0089 5.0080 10.2950 7.0067 11.1534 11.0356 6.8189 6.7618 8.2060 13.2369 9.4499 6.1051 9.2005 8.8586 9.0808 8.6833 8.8670 9.5644 5.3273 6.0743 3.0239 9.0092 3.6832 8.3497 5.1070 6.9128 9.3037 7.5043 4.0776 5.6046 6.5435 6.7308 7.3158 9.5001 2.1491 3.9864 8.5619 5.2215 1.6022 2.5590 1.8077 1.6522 1.5043 1.3695 1.8574 3.6886 1.4428 1.8975 5.6261 7.0278 3.3018 1.3775 3.6873 4.5645 2.2910 1.6496 1.4197 1.0994 1.1818 2.8436 1.2262 3.2129 4.8970 1.3200 1.3079 5.8565 4.4683 3.0645 3.1761 2.4205 2.6096 6.0774 6.6854 6.8016 6.1359 12.6306 1.0894 1.0877 1.0911 1.0913 1.0965 1.0933 1.0972 1.1001 1.0749
irintensity: 0.7081 0.3533 1.4809 0.8672 1.7435 2.6607 2.7927 2.5273 2.0675 0.7358 0.7896 2.4454 7.4401 8.7897 8.8537 21.2369 15.0171 4.1035 4.1563 10.0738 4.1600 1.7189 2.8189 88.5451 49.7565 0.0854 72.7732 0.8837 2.5282 0.5702 11.4760 39.2035 7.1061 2.4930 5.2549 2.9842 27.7949 3.2256 32.5034 84.4496 17.4357 6.6193 6.1494 154.3308 53.8918 0.2253 25.0060 33.1814 9.5609 79.7706 11.4373 171.4645 118.9554 0.3295 132.7292 119.7513 16.5324 19.1625 1.2724 4.5818 25.9949 3.2707 5.0902 2.4502 451.1997 7.9344 1.0343 5.4105 1.1302 9.0158 20.4238 20.2247 0.8157 12.2989 1.9879 0.5690 41.5136 9.8370 4.1711 4.1172 1.0120 10.3576 3.2347 0.7463 1.0103 7.7404 19.4249
temp: 298.150 k
press: 1.00000 atm
elementType: 16 9 9 9 8 8 7 7 6 6 6 6 6 6 6 6 6 6 6 6 6 6 1 1 1 1 1 1 1 1 1
symmnumber: 1
zpe: 529368.8 jmol-1
zpe.correction: 0.201626 hartree
zpe.thermalcorrener: 0.222206 hartree
zpe.thermalcorrenthalpy: 0.223150 hartree
zpe.thermalcorrgfe: 0.145997 hartree
zpe.sumelectzpe: -1494.688627 hartree
zpe.sumelectthermal: -1494.668047 hartree
zpe.sumelectthermalent: -1494.667103 hartree
zpe.sumelectthermalfe: -1494.744256 hartree
dipole: -3.5071 -2.5929 -4.9697
dipole: 6.6122
quadrupole: -135.7452 -148.9692 -140.2134
quadrupole: -7.2112 15.5469 1.1566
quadrupole: 5.8974 -7.3266 1.4292 -7.2112 15.5469 1.1566
hfenergy: -1494.8902531 hartree
pointgroup: C01 [X(C14H9F3N2O2S1)]
dipole: 1.4545684 0.3259884 2.132001 debye
polarizability: 276.6505346|27.7796887|211.7268393|18.5820425|-44.7463919|155.3773334 unknown
InChI: InChI=1S/C14H9F3N2O2S/c15-14(16,17)11-4-6-12(7-5-11)19-22(20,21)13-3-1-2-10(8-13)9-18/h1-8,19H
charge 0 multiplicity 1
31 atoms
S  2.036296 -1.594071 0.028894
F  -5.117256 0.505839 -0.617689
F  -5.255212 -1.705715 -1.111139
F  -5.714157 -0.990358 0.983597
O  3.111215 -2.635701 0.669611
O  1.377278 -1.789015 -1.445823
N  0.653048 -1.485585 1.44076
N  2.4379 4.06642 -2.811687
C  2.78387 0.138489 0.075588
C  -0.690071 -1.346771 1.004665
C  -3.392457 -0.96192 0.265581
C  -1.110962 -0.111929 0.437479
C  -1.640597 -2.394094 1.181165
C  2.436393 1.021586 -0.953125
C  3.682308 0.442756 1.110968
C  -2.451471 0.074731 0.060805
C  -2.987178 -2.194806 0.834221
C  3.0250 2.316561 -0.930415
C  4.258009 1.734286 1.116895
C  -4.833083 -0.781696 -0.114815
C  3.930623 2.666603 0.109786
C  2.704305 3.270425 -1.960659
H  0.83711 -2.380749 1.936248
H  -0.388174 0.701883 0.32411
H  -1.319886 -3.356726 1.596011
H  1.757523 0.712615 -1.754871
H  3.9354 -0.303618 1.870085
H  -2.773623 1.025073 -0.373816
H  -3.716782 -2.99617 0.98735
H  4.96301 2.01035 1.906521
H  4.377021 3.665605 0.115698
