program: Gaussian 09
title: 000183791
version: EM64L-G09RevD.01
frameworkgroup: C1[X(C20H18N2O3S)]
method: RPBEPBE
basis: SDD
operation: Freq
keyword: #p
keyword: freq=noraman
keyword: PBEPBE/SDD
title: #p freq=noraman PBEPBE/SDD
converged: YES YES NO NO
title: Mulliken charges:
elementType: S O O O N N C C C C C C C C C C C C C C C C C C C C H H H H H H H H H H H H H H H H H H
charge: 0.258968 -0.261437 -0.205981 -0.148444 -0.458904 -0.332444 0.009330 -0.537990 -0.538438 0.347451 0.171970 -0.410629 -0.410051 0.479544 -0.227707 -0.227557 -0.239347 -0.469782 -0.355193 0.498042 -0.552707 -0.381019 -0.389131 -0.586191 0.268885 -0.090407 0.277963 0.243011 0.242921 0.277841 0.254154 0.253898 0.334749 0.232236 0.232179 0.232977 0.227125 0.309994 0.243698 0.257668 0.325977 0.236331 0.241014 0.365435
chargesum: 0.00000
title: Mulliken charges with hydrogens summed into heavy atoms:
elementType: S O O O N N C C C C C C C C C C C C C C C C C C C C
charge: 0.258968 -0.261437 -0.205981 -0.148444 -0.124155 0.032992 0.009330 -0.017016 -0.017677 0.347451 0.171970 -0.156475 -0.156152 0.479544 0.004529 0.004622 -0.006371 -0.242657 -0.045199 0.498042 -0.051341 -0.144688 -0.148118 -0.260214 0.268885 -0.090407
polarizability: 3.52020478e+02 4.94536513e+00 2.63293703e+02 4.49427119e+00 -7.98668373e+00 1.76583929e+02
1716.lowfreq: -6.5661 -3.1033 0.0006 0.0011 0.0018 3.7325 10.0532 20.4272 27.1389
frequency: 9.9275 20.3317 27.0737 32.5330 37.0965 42.1467 53.1772 70.1728 87.8161 116.7081 153.3221 154.5490 162.5155 183.2427 217.8087 250.2409 268.5572 292.1908 325.5355 333.0774 347.1339 364.3766 383.3911 399.0974 403.0935 410.2340 436.9155 462.2159 481.3065 517.7226 539.2574 563.5216 567.3665 597.0051 614.7108 616.0862 626.2724 641.7167 662.3213 672.6406 692.3804 708.1621 710.9879 731.6141 743.4319 747.9846 773.9492 794.7944 811.4742 831.1792 838.5220 859.4020 861.2655 873.5387 893.2624 913.2414 922.8307 938.8021 953.2352 954.3477 960.5348 983.6747 990.0379 993.0547 1000.7554 1007.7430 1022.5241 1026.4972 1070.9847 1077.7563 1095.5210 1097.2204 1115.6628 1125.4018 1149.8348 1153.1071 1173.6045 1182.7103 1185.2103 1192.8403 1215.5074 1221.7967 1260.3562 1261.3432 1267.9266 1272.6713 1312.4957 1314.8400 1327.3975 1335.6390 1352.9965 1370.8109 1380.6413 1412.6020 1426.5261 1432.6282 1449.4295 1463.0408 1484.9830 1499.4319 1513.0871 1583.2503 1589.9862 1606.9096 1609.5057 1626.9024 1650.7424 1685.7536 2996.6958 3049.6478 3067.1011 3100.5790 3107.3708 3109.5157 3124.2443 3127.3382 3131.2042 3135.3565 3139.5882 3149.6208 3165.9015 3194.1271 3207.7095 3223.5180 3490.8397 3531.5730
redmass: 7.0820 5.4262 6.5406 6.0901 4.4518 7.1317 7.2102 5.8729 6.7789 5.7105 5.4062 6.7258 7.0241 4.4016 4.3455 4.2101 3.2546 3.5037 4.6263 4.2935 10.7607 6.9967 4.2841 3.1566 2.8321 2.9952 13.9162 4.3743 6.3355 3.7848 3.4419 9.5702 3.5727 4.6774 6.3375 5.7768 5.4700 5.7113 4.5839 1.2041 3.4594 1.7739 5.8154 3.1895 2.6703 2.0736 1.9284 2.6738 1.2502 1.5447 4.4545 1.4000 1.4341 4.9659 3.2205 3.0904 1.6737 1.8492 1.6070 2.9363 1.1767 1.3824 6.1350 1.3365 1.3145 3.0257 2.3487 4.4285 1.2693 1.5420 1.3992 1.8163 1.3564 4.4359 1.3757 2.1673 1.0546 1.2861 1.1160 1.1162 1.3346 2.3887 2.6724 1.9203 2.5456 2.4240 1.3660 1.4688 1.4276 2.9667 1.6363 7.3901 4.2148 3.5353 1.0910 2.1850 1.3011 1.1047 2.4752 2.0579 2.9140 6.0150 6.7421 4.1612 6.0434 6.4521 7.5888 12.2830 1.0602 1.0881 1.0979 1.0502 1.0613 1.0871 1.0851 1.0878 1.0936 1.0944 1.0920 1.0964 1.1015 1.0945 1.1178 1.1164 1.0760 1.0780
irintensity: 0.0625 0.0516 0.0483 0.0625 1.3270 0.0561 0.7110 2.1714 1.3610 0.9002 4.8331 3.1469 4.3715 0.3860 8.8889 2.0037 1.3400 0.8942 7.4593 2.0632 6.6419 15.5895 4.4031 0.3285 0.0032 0.1505 7.6489 1.6015 10.9720 12.6281 36.0926 0.4217 39.3173 6.0026 0.0055 33.4457 1.0411 4.1652 25.6415 20.9140 14.7458 60.0857 7.8277 19.2604 26.2385 69.5109 13.1382 8.9116 6.7790 39.2878 1.5823 0.4451 29.1682 0.1178 13.8473 2.6725 13.4912 12.1417 15.1337 53.2970 0.2429 0.2168 0.4375 2.6747 0.6973 0.8179 10.9371 5.5370 23.8491 13.2509 2.1794 8.4109 9.1642 148.0535 24.5440 46.2221 0.0100 0.4794 0.4711 14.1739 24.3868 4.2651 152.8903 48.1474 26.7739 98.8896 0.7556 78.5393 10.1547 3.6805 4.7319 0.0125 132.6760 48.8283 14.9449 7.0115 20.1882 8.6575 15.5912 181.3030 525.3890 1.6130 55.0241 124.0778 10.2772 44.2507 482.3568 365.1148 11.7905 0.9699 8.0443 9.7346 10.6951 19.1697 3.9430 0.0813 23.5281 4.9887 10.5872 30.6443 20.4392 6.3940 0.0599 7.6166 66.4406 67.9709
temp: 298.150 k
press: 1.00000 atm
elementType: 16 8 8 8 7 7 6 6 6 6 6 6 6 6 6 6 6 6 6 6 6 6 6 6 6 6 1 1 1 1 1 1 1 1 1 1 1 1 1 1 1 1 1 1
symmnumber: 1
zpe: 886939.0 jmol-1
zpe.correction: 0.337817 hartree
zpe.thermalcorrener: 0.360933 hartree
zpe.thermalcorrenthalpy: 0.361877 hartree
zpe.thermalcorrgfe: 0.280464 hartree
zpe.sumelectzpe: -1504.352216 hartree
zpe.sumelectthermal: -1504.329100 hartree
zpe.sumelectthermalent: -1504.328155 hartree
zpe.sumelectthermalfe: -1504.409569 hartree
dipole: 4.1035 4.2416 0.1003
dipole: 5.9025
quadrupole: -153.3679 -167.3920 -157.4578
quadrupole: 4.2421 8.1499 6.3594
quadrupole: 6.0380 -7.9861 1.9481 4.2421 8.1499 6.3594
hfenergy: -1504.6900328 hartree
pointgroup: C01 [X(C20H18N2O3S1)]
dipole: 1.5379736 -0.8394298 1.524055 debye
polarizability: 351.3007621|1.2763086|192.251427|10.4802575|-34.4187228|248.3459209 unknown
InChI: InChI=1S/C20H18N2O3S/c23-17-16(26-19(25)22-17)12-13-6-8-15(9-7-13)21-18(24)20(10-11-20)14-4-2-1-3-5-14/h1-9,16,21-22H,10-12H2
charge 0 multiplicity 1
44 atoms
S  -4.559071 -0.367096 -1.703423
O  2.214963 2.07011 -1.826358
O  -6.405368 -0.673947 1.836916
O  -7.103889 -0.41213 -2.799584
N  1.869419 0.596423 -0.029051
N  -6.914423 -0.562175 -0.452328
C  4.154985 0.940139 -0.874094
C  5.068627 2.126852 -1.271287
C  4.877632 0.972717 -2.244307
C  4.621052 -0.02841 0.184781
C  2.666023 1.258384 -0.959974
C  4.681086 -1.421942 -0.08406
C  4.963632 0.429736 1.485196
C  0.46166 0.673405 0.150211
C  5.078921 -2.334614 0.918847
C  5.361433 -0.480727 2.489996
C  5.419232 -1.866475 2.20996
C  -0.10689 -0.107853 1.193913
C  -0.385418 1.485933 -0.650055
C  -2.353162 0.72309 0.636046
C  -3.853468 0.719718 0.87976
C  -1.493414 -0.080487 1.429201
C  -1.773012 1.499599 -0.397244
C  -4.569686 -0.480127 0.200363
C  -6.037023 -0.588208 0.640274
C  -6.411939 -0.449899 -1.767652
H  4.561649 3.066171 -1.507038
H  6.024881 2.209191 -0.746715
H  5.704381 0.270191 -2.38377
H  4.245474 1.156403 -3.11698
H  4.422597 -1.783298 -1.086424
H  4.924922 1.50435 1.699408
H  2.369775 -0.029372 0.609904
H  5.125546 -3.406145 0.69466
H  5.628272 -0.111728 3.486632
H  5.731259 -2.572709 2.987308
H  0.541261 -0.731129 1.823274
H  0.052028 2.089924 -1.446579
H  -4.31491 1.657533 0.521449
H  -4.071555 0.633897 1.961954
H  -4.05577 -1.419212 0.46901
H  -1.910889 -0.681124 2.247173
H  -2.417333 2.129496 -1.022051
H  -7.927293 -0.617854 -0.309062
