program: Gaussian 09
title: 000183750
version: EM64L-G09RevD.01
frameworkgroup: C1[X(C13H16N)]
method: RPBEPBE
basis: SDD
operation: Freq
keyword: #p
keyword: freq=noraman
keyword: PBEPBE/SDD
title: #p freq=noraman PBEPBE/SDD
converged: YES YES NO NO
title: Mulliken charges:
elementType: N C C C C C C C C C C C C C H H H H H H H H H H H H H H H H
charge: -0.030851 -0.531018 0.564534 -0.419862 -0.746871 -0.412618 -0.081019 0.479780 -0.586988 -0.378222 -0.424261 -0.213845 -0.213187 -0.228467 0.273653 0.284161 0.283072 0.271147 0.266419 0.255285 0.278482 0.281687 0.277872 0.275147 0.254316 0.235586 0.240502 0.245629 0.248318 0.251621
chargesum: 1.00000
title: Mulliken charges with hydrogens summed into heavy atoms:
elementType: N C C C C C C C C C C C C C
charge: -0.030851 0.026795 0.564534 0.134357 -0.225166 -0.134136 0.200668 0.479780 0.220346 -0.142636 -0.183760 0.031784 0.035131 0.023154
polarizability: 2.18076578e+02 -1.52966146e+01 1.17898484e+02 -4.52355175e+00 6.56340901e+00 1.19557884e+02
1716.lowfreq: -12.3394 -8.5346 -4.0148 -0.0004 0.0003 0.0005 23.4780 33.0609 51.2994
frequency: 22.9743 32.7129 51.2702 104.5525 157.2217 171.9828 204.5983 259.9072 300.6642 330.9025 367.2149 401.0745 405.3643 435.5478 495.7176 509.5434 528.2105 614.7540 625.5358 701.8986 713.0421 747.8390 762.0129 774.7541 806.6073 854.1489 855.5679 909.6715 929.8155 959.3378 976.9093 982.5649 989.1838 997.5604 1008.4346 1025.1422 1044.5115 1078.3562 1084.2122 1113.0778 1135.5782 1151.0082 1154.3241 1180.2529 1190.5477 1191.0568 1194.7926 1222.0655 1263.1954 1274.0924 1327.9119 1335.2330 1347.9397 1373.8159 1381.8640 1408.1287 1433.5061 1437.0645 1439.6531 1444.2391 1457.7235 1464.8104 1480.3377 1481.3024 1576.4265 1592.8810 1605.3448 1632.2110 2973.3878 2985.9094 2993.7844 3003.2918 3050.7955 3063.2222 3091.3840 3096.0454 3116.7416 3123.4606 3132.1073 3146.2167 3155.0256 3157.4393 3174.9651 3180.2452
redmass: 3.5370 3.5111 3.9322 3.7465 1.9411 1.0976 4.0342 3.9482 3.1890 2.1731 2.6493 2.7771 2.2396 3.3748 3.6905 2.4530 4.3556 6.2783 4.0902 2.7171 2.0483 3.1910 2.1189 1.9833 2.9817 1.4231 1.3149 1.6307 1.4391 2.3259 1.5917 1.3935 5.4776 2.0376 1.3394 2.2834 1.9153 1.7728 1.6159 1.2890 1.7529 2.0233 1.3736 1.0598 1.6447 1.1276 2.3052 1.8965 1.3216 1.4266 1.2819 1.3793 1.3794 1.8248 7.3708 1.7123 1.1923 1.1872 1.3389 1.4777 1.0569 1.0774 1.1485 1.9790 5.4503 5.9208 5.9330 4.6035 1.0633 1.0697 1.0634 1.0347 1.0965 1.0934 1.0984 1.1025 1.0894 1.0896 1.1031 1.0895 1.0928 1.0952 1.1013 1.0957
irintensity: 0.4962 0.4279 1.2231 0.3341 0.4661 0.4213 6.8440 3.9697 1.8750 1.4255 2.8976 0.2508 8.3342 3.8619 11.3867 7.3644 1.8007 0.1707 6.9581 11.7763 54.6313 6.9788 4.2356 41.3807 3.4303 23.4980 8.8780 9.1994 1.2117 2.8789 3.7270 0.1251 4.9691 3.2604 0.2109 4.9813 0.6962 5.5377 12.9908 2.3798 11.4381 24.6980 12.3456 0.1582 3.0453 2.2187 5.1991 8.7023 10.0724 2.0378 2.8923 2.2270 58.4831 26.8090 0.4929 2.4821 10.4398 40.6942 8.3958 25.9592 27.0176 5.4440 36.8756 14.1208 534.9184 31.8517 16.0306 48.7528 6.5992 1.5539 12.7262 7.7141 8.4567 2.9110 3.0774 3.4192 6.8147 6.2592 3.9063 1.0574 1.3516 16.5591 13.3044 0.4648
temp: 298.150 k
press: 1.00000 atm
elementType: 7 6 6 6 6 6 6 6 6 6 6 6 6 6 1 1 1 1 1 1 1 1 1 1 1 1 1 1 1 1
symmnumber: 1
zpe: 675625.3 jmol-1
zpe.correction: 0.257332 hartree
zpe.thermalcorrener: 0.270188 hartree
zpe.thermalcorrenthalpy: 0.271132 hartree
zpe.thermalcorrgfe: 0.216298 hartree
zpe.sumelectzpe: -558.468993 hartree
zpe.sumelectthermal: -558.456137 hartree
zpe.sumelectthermalent: -558.455193 hartree
zpe.sumelectthermalfe: -558.510027 hartree
dipole: -8.9031 -0.7996 0.2457
dipole: 8.9423
quadrupole: -27.7745 -70.1851 -71.7431
quadrupole: -0.7287 -4.5287 2.4426
quadrupole: 28.7931 -13.6175 -15.1756 -0.7287 -4.5287 2.4426
hfenergy: -558.7263252 hartree
pointgroup: C01 [X(C13H16N1)]
dipole: -3.5129761 -0.0739597 -0.176308 debye
polarizability: 214.9302451|21.7665342|127.623139|-8.5900634|1.4813769|112.9795615 unknown
InChI: InChI=1S/C13H16N/c1-14-9-7-13(8-10-14)11-12-5-3-2-4-6-12/h2-7,9H,8,10-11H2,1H3
charge 1 multiplicity 1
30 atoms
N  -3.391517 -0.145567 -0.325653
C  -1.133944 0.941008 -0.082565
C  -0.796128 -0.149906 0.922927
C  -2.650858 1.157075 -0.224216
C  0.549891 -0.12478 1.60331
C  -1.7090 -1.177474 1.097838
C  -2.939651 -1.198622 0.354085
C  1.698398 0.042058 0.598683
C  -4.662396 -0.14963 -1.086429
C  1.979412 -0.994424 -0.329801
C  2.485161 1.219887 0.581796
C  3.036087 -0.855551 -1.256243
C  3.543405 1.358634 -0.345343
C  3.818482 0.323272 -1.268122
H  -0.660734 1.897292 0.202639
H  -0.673942 0.664413 -1.0530
H  -3.06338 1.689553 0.656286
H  -2.881921 1.753633 -1.12155
H  0.68369 -1.03737 2.21167
H  0.564816 0.734775 2.305428
H  -1.489604 -2.03311 1.741237
H  -3.550085 -2.108148 0.32886
H  -4.459425 0.031599 -2.155811
H  -5.320427 0.652382 -0.708725
H  -5.172447 -1.118265 -0.973184
H  1.389922 -1.9202 -0.31433
H  2.289681 2.020396 1.306052
H  3.255986 -1.665503 -1.959711
H  4.156257 2.265999 -0.340919
H  4.641571 0.428975 -1.982311
