program: Gaussian 09
title: 000183757
version: EM64L-G09RevD.01
frameworkgroup: C1[X(C22H14O6)]
method: RPBEPBE
basis: SDD
operation: Freq
keyword: #pfreq=noraman
keyword: PBEPBE/SDD
title: #p freq=noraman PBEPBE/SDD
converged: YES YES NO NO
title: Mulliken charges:
elementType: O O O O O O C C C C C C C C C C C C C C C C C C C C C C H H H H H H H H H H H H H H
charge: -0.307360 -0.154253 -0.178319 -0.185503 -0.386664 -0.372686 0.132810 0.098404 0.207823 0.213296 0.037196 0.151382 0.041755 -0.088201 0.322723 0.311889 -0.211934 -0.187290 -0.830258 -0.824614 0.139403 0.177517 -0.412124 -0.406050 -0.352475 -0.411275 -0.187079 -0.202639 0.280464 0.270762 0.227118 0.226622 0.271881 0.270446 0.290781 0.295373 0.265655 0.227795 0.242496 0.243262 0.389176 0.362695
chargesum: 0.00000
title: Mulliken charges with hydrogens summed into heavy atoms:
elementType: O O O O O O C C C C C C C C C C C C C C C C C C C C C C
charge: -0.307360 -0.154253 -0.178319 -0.185503 0.002512 -0.009991 0.132810 0.098404 0.207823 0.213296 0.037196 0.151382 0.041755 -0.088201 0.322723 0.311889 -0.211934 -0.187290 -0.051915 -0.055665 0.139403 0.177517 -0.121343 -0.110677 -0.086820 -0.183479 0.055417 0.040623
polarizability: 4.04638952e+02 1.51253590e+01 2.61420043e+02 -4.69863049e+00 1.76675952e+00 1.89464174e+02
1716.lowfreq: -4.1457 -0.9511 -0.0004 0.0006 0.0008 9.7085 21.9696 32.9376 34.4855
frequency: 21.8951 32.9266 34.3540 60.9665 74.1001 79.6201 102.9040 114.6673 128.0535 142.0854 146.7966 166.0792 174.3700 184.0959 232.0124 234.2079 248.8632 261.0401 318.6854 323.9022 340.3960 347.8269 356.0500 364.4315 382.6006 410.6770 415.5250 422.5631 426.5921 437.9326 441.2056 459.5142 481.7495 495.6896 500.0799 519.8009 533.9855 546.7171 549.3360 583.9079 595.9147 667.6744 670.1327 671.9858 703.7908 707.8265 732.1199 746.0470 778.1577 784.0990 792.4881 814.5411 832.4447 845.8568 874.4445 893.6150 913.1632 930.0023 932.7158 937.3238 992.5829 993.1916 997.4823 1003.9871 1017.9325 1032.7290 1035.8321 1053.7772 1065.6686 1090.8023 1111.3617 1154.3108 1168.5034 1178.4873 1184.8941 1213.6738 1240.9843 1261.8907 1264.9467 1280.9617 1295.1958 1310.5428 1330.3649 1380.2678 1389.4527 1390.7931 1402.6246 1415.8126 1431.9963 1441.9626 1443.7965 1453.2920 1454.6567 1460.0434 1464.4225 1469.9076 1523.6198 1526.6570 1539.9836 1543.1369 1577.8429 1583.6216 1594.8084 1599.8339 1620.5397 1634.0809 2773.6160 2986.5096 2988.4898 3070.4752 3072.5155 3111.2883 3112.3585 3117.1741 3147.1336 3155.2605 3169.3264 3175.8756 3181.5055 3534.0055
redmass: 6.6720 7.5232 6.4823 6.5330 8.4646 8.0322 3.9312 4.5039 1.0687 4.6185 1.1513 5.9799 5.2149 6.2901 4.9755 5.1598 5.5456 4.7347 3.5907 3.8240 5.3208 4.7258 6.6327 6.8093 10.1996 8.5595 6.6686 4.5149 1.3233 5.9772 6.0353 6.2050 8.1990 7.5495 4.9173 5.7197 4.6686 4.7065 4.7336 7.5535 6.7903 5.1647 6.4167 4.4587 3.8140 4.3174 6.7864 5.2924 2.6716 2.4988 2.3105 3.6983 2.5276 5.3088 6.1720 6.8542 1.4351 1.3284 3.6340 1.1571 1.5667 3.0239 1.3773 3.5698 2.5255 1.6266 1.6925 2.1381 2.4846 2.1704 2.4355 1.5563 1.4600 1.2327 1.9492 2.3292 2.2362 2.9584 3.8013 4.4556 3.0710 5.6577 4.6712 2.9549 1.2827 1.3415 7.6286 8.0276 3.5765 2.4885 2.3216 1.1956 1.2087 1.1137 1.1067 2.7664 9.6085 4.1538 8.2302 5.9959 5.1769 6.0503 6.9463 7.1372 6.9064 8.0033 1.0703 1.0393 1.0387 1.0925 1.0934 1.1003 1.1004 1.0896 1.0879 1.0913 1.0930 1.0975 1.0980 1.0657
irintensity: 2.5572 0.2920 1.4882 3.0671 1.2724 5.6056 1.1204 0.1634 1.3755 1.9953 1.1964 0.0075 0.4469 0.0883 1.2400 0.8703 2.5743 0.1513 1.1029 1.0850 0.6647 5.9805 1.8193 5.8491 17.9949 16.0933 1.9819 18.4418 78.6132 12.8692 31.4419 19.5787 1.7857 3.7332 1.6389 8.0954 1.1233 3.9849 4.5511 9.2589 5.6418 3.0924 36.0143 11.7541 7.7268 12.2002 6.0422 18.0904 15.2446 21.3161 61.0322 12.9497 29.1781 2.0123 23.1179 29.4057 1.7775 19.2745 2.5802 83.7496 10.9024 45.0818 2.2243 8.8547 60.9257 19.8590 6.4423 23.5607 14.3964 7.0685 17.7697 120.8924 15.3453 6.2834 5.9349 12.2134 49.1415 437.0184 63.4439 221.7400 129.5000 241.0367 6.5819 116.0727 73.8016 39.1142 2.4360 14.4023 8.3439 15.6231 86.0411 24.7192 74.9345 56.9224 7.4829 19.9372 35.1397 105.8276 268.0415 79.1882 44.1895 130.8379 23.5549 4.4870 11.4117 27.2675 155.7991 3.1906 4.7490 9.5946 10.8058 4.2029 2.4369 11.5367 9.7915 11.2052 1.2205 10.7599 11.8049 37.2214
temp: 298.150 k
press: 1.00000 atm
elementType: 8 8 8 8 8 8 6 6 6 6 6 6 6 6 6 6 6 6 6 6 6 6 6 6 6 6 6 6 1 1 1 1 1 1 1 1 1 1 1 1 1 1
symmnumber: 1
zpe: 790380.7 jmol-1
zpe.correction: 0.301040 hartree
zpe.thermalcorrener: 0.324633 hartree
zpe.thermalcorrenthalpy: 0.325577 hartree
zpe.thermalcorrgfe: 0.247648 hartree
zpe.sumelectzpe: -1296.172903 hartree
zpe.sumelectthermal: -1296.149310 hartree
zpe.sumelectthermalent: -1296.148366 hartree
zpe.sumelectthermalfe: -1296.226295 hartree
dipole: -3.0694 1.4140 -0.7094
dipole: 3.4531
quadrupole: -112.8668 -172.2538 -162.0309
quadrupole: -15.6933 10.5046 -5.5917
quadrupole: 36.1837 -23.2033 -12.9804 -15.6933 10.5046 -5.5917
hfenergy: -1296.473943 hartree
pointgroup: C01 [X(C22H14O6)]
dipole: -1.1707266 -0.3012257 -0.6199851 debye
polarizability: 405.9525273|-1.05042|189.3539425|-7.2026992|-1.8273868|260.2166996 unknown
InChI: InChI=1S/C22H14O6/c1-9-15(21(27)17-11(19(9)25)5-3-7-13(17)23)16-10(2)20(26)12-6-4-8-14(24)18(12)22(16)28/h3-8,23-24H,1-2H3
charge 0 multiplicity 1
42 atoms
O  1.051983 -0.834372 1.815652
O  -0.944137 -0.844906 -1.809596
O  3.284381 1.837383 -2.420499
O  -3.307383 1.718504 2.414005
O  3.322249 -1.727622 2.542698
O  -3.330846 -1.811673 -2.566489
C  0.74016 0.571743 -0.121858
C  -0.734636 0.545908 0.127816
C  1.294926 1.234266 -1.202374
C  -1.297956 1.193842 1.206161
C  3.033721 -0.287362 0.581986
C  -3.010774 -0.392282 -0.611593
C  1.589436 -0.210408 0.809508
C  -1.54299 -0.275868 -0.84258
C  3.634938 0.392167 -0.518472
C  -3.60493 0.275528 0.504501
C  2.781387 1.194631 -1.442862
C  -2.773109 1.101436 1.436472
C  0.47967 2.014276 -2.199702
C  -0.50981 2.003829 2.20473
C  3.854978 -1.05679 1.472226
C  -3.868731 -1.155401 -1.464489
C  5.024723 0.310625 -0.729741
C  -4.989762 0.186396 0.767296
C  5.258204 -1.132491 1.24789
C  -5.260518 -1.241586 -1.19058
C  5.828139 -0.453762 0.157798
C  -5.816417 -0.576203 -0.082883
H  0.121286 1.330272 -2.993264
H  1.10014 2.784265 -2.684537
H  -0.408043 2.475858 -1.735825
H  0.365802 2.489123 1.742107
H  -0.138589 1.339285 3.008256
H  -1.154814 2.760826 2.678185
H  5.459573 0.842075 -1.581105
H  -5.38892 0.718436 1.635119
H  5.863468 -1.726198 1.938573
H  -5.90387 -1.835069 -1.85353
H  6.908505 -0.518012 -0.008356
H  -6.890377 -0.65404 0.113512
H  2.300388 -1.558117 2.528529
H  -4.039742 -2.30221 -3.058286
