program: Gaussian 09
title: 000183742
version: EM64L-G09RevD.01
frameworkgroup: C1[X(C23H32O)]
method: RPBEPBE
basis: SDD
operation: Freq
keyword: #pfreq=noraman
keyword: PBEPBE/SDD
title: #p freq=noraman PBEPBE/SDD
converged: YES YES NO NO
title: Mulliken charges:
elementType: O C C C C C C C C C C C C C C C C C C C C C C C H H H H H H H H H H H H H H H H H H H H H H H H H H H H H H H H
charge: -0.282892 0.015541 -0.620046 -0.394564 -0.414408 0.521436 -0.214433 -0.718726 -0.714650 0.537450 -0.369007 -0.418889 -0.405278 -0.717047 0.357713 -0.353945 -0.392346 -0.402918 -0.452573 0.428798 -0.692269 -0.428572 -0.448171 -0.383019 0.201847 0.201042 0.207592 0.193673 0.204333 0.222589 0.207560 0.200825 0.214177 0.222070 0.211275 0.215396 0.220692 0.212867 0.195291 0.197231 0.228287 0.230230 0.210412 0.211417 0.227303 0.228137 0.231833 0.246192 0.246704 0.234019 0.204545 0.212178 0.219923 0.219185 0.225705 0.258285
chargesum: 0.00000
title: Mulliken charges with hydrogens summed into heavy atoms:
elementType: O C C C C C C C C C C C C C C C C C C C C C C C
charge: -0.282892 0.217388 -0.211412 0.003442 0.015741 0.521436 -0.013607 -0.071204 -0.065696 0.537450 0.023515 -0.190602 -0.175048 -0.067915 0.357713 -0.107753 -0.145643 -0.174781 -0.220739 0.428798 -0.041528 0.010537 -0.222466 -0.124734
polarizability: 3.81813571e+02 7.77195887e+00 2.06574868e+02 5.25126929e+00 -2.52204447e+01 1.92526913e+02
1716.lowfreq: -16.8775 -13.7626 -3.9403 -0.0015 -0.0008 0.0009 1.4959 14.7449 20.2026
frequency: -14.3653 14.2462 20.1602 24.6779 33.8074 44.4569 53.6250 67.4101 85.6068 98.9579 114.1821 126.5193 145.2798 161.0099 170.9410 189.2095 208.9740 213.7444 223.4098 226.9529 242.1520 260.7668 283.6898 289.8553 326.3593 337.2622 341.6039 355.0001 403.6167 411.6544 420.6958 439.5067 458.4059 469.7514 505.3828 523.0486 541.0028 548.7468 584.4763 631.6589 637.5166 697.9538 714.9550 731.3350 744.5194 754.5201 771.1652 796.2466 801.8075 813.1112 818.5519 823.3672 840.0833 844.9621 850.6671 855.6629 894.7907 927.5624 939.1335 948.9028 955.9947 959.7870 964.4569 975.5983 979.3361 995.0554 1003.7908 1004.5443 1011.3891 1014.9781 1026.3736 1028.8126 1055.8752 1068.7033 1078.6633 1101.0390 1113.4996 1122.7777 1148.1321 1152.3908 1153.4249 1177.5944 1184.9114 1186.7921 1203.8897 1213.5043 1214.7540 1222.6607 1229.9659 1245.8672 1245.8904 1270.0925 1273.5791 1284.3601 1301.0448 1305.7617 1318.8925 1326.4734 1332.9279 1334.1761 1342.7708 1353.8866 1360.3161 1378.9066 1382.0325 1387.1205 1390.0580 1391.0485 1391.7844 1412.8254 1416.6377 1461.1696 1463.6769 1468.1987 1470.0601 1471.8321 1476.5056 1477.4785 1477.7294 1479.7406 1484.4297 1485.6816 1487.1381 1493.7185 1500.9197 1508.4601 1582.4993 1584.9652 1622.5983 1625.7446 2930.7963 2940.7741 2961.8745 2964.7993 2971.3619 2972.7206 2973.3155 2974.1892 2976.2466 2977.3886 2984.7025 2990.3371 3010.6591 3020.2613 3026.6046 3031.2491 3066.0204 3066.0514 3069.1351 3069.4441 3070.6380 3074.8721 3077.1697 3079.4781 3106.2769 3115.8992 3118.2710 3122.9284 3131.8685 3158.5792 3162.5286 3162.9449
redmass: 3.3077 4.6495 3.6443 3.5018 3.2696 3.8596 4.0594 3.9260 2.5859 3.0787 1.9618 2.2730 3.1024 2.2359 3.7017 2.8022 1.2586 1.5544 1.4271 1.5448 1.4685 2.6366 2.5606 1.9359 2.8245 3.3329 3.9297 2.4728 2.8359 2.9498 3.0551 3.4444 2.8050 3.8999 2.9734 2.4150 2.5634 2.5890 3.6509 6.8281 6.8518 2.9525 3.1298 2.8682 1.7777 1.6982 2.5832 1.2980 1.4225 1.8196 1.7224 2.3956 1.7150 2.0196 2.2477 1.4801 1.5957 1.5397 1.5573 1.3799 1.2445 1.6927 1.6647 1.3857 7.4018 1.6767 1.8465 1.8124 2.1470 2.0804 1.7230 2.5033 2.4798 1.6290 1.5144 2.4842 1.5277 1.3788 1.9323 2.3665 1.9128 1.2931 1.2819 1.1218 1.1781 1.9348 2.0640 3.3635 2.5283 1.2815 1.3174 1.2539 1.1068 1.3104 1.3080 1.3251 1.4252 1.7020 1.5079 1.5706 1.4829 1.3941 1.5159 1.3276 3.2799 1.2299 1.2281 2.1386 1.5430 2.3336 3.1387 1.0683 1.0636 1.0718 1.1305 1.0537 1.0709 1.0534 1.0441 1.0863 1.0470 1.0606 1.0577 1.0709 2.3956 2.5989 6.7717 6.8169 6.4685 6.4059 1.0575 1.0814 1.0600 1.0711 1.0556 1.0577 1.0483 1.0370 1.0389 1.0395 1.0619 1.1029 1.1000 1.1010 1.1001 1.0991 1.0996 1.0994 1.0993 1.0992 1.0995 1.0995 1.1000 1.0999 1.0868 1.0892 1.0895 1.0890 1.0960 1.0936 1.0951 1.0945
irintensity: 0.1656 0.1439 0.7899 0.0287 0.2479 0.1182 0.0693 0.0546 0.2774 1.9248 0.8542 1.9597 0.7412 0.1278 1.4659 1.0428 0.0491 0.3314 0.0963 0.2624 0.1919 0.4909 0.2784 0.1411 1.5596 1.7286 0.6453 0.3515 1.0032 0.0382 2.0276 1.1467 0.8355 0.5410 3.0941 7.2127 17.6370 20.6126 10.9878 0.5339 0.1529 2.1280 2.2552 5.4494 7.3021 17.4657 0.9627 13.8870 23.7829 5.5616 9.6985 34.1309 18.8511 22.3685 5.0680 15.7791 4.5820 6.8331 1.6655 4.5314 7.1382 1.0436 1.0804 0.8207 106.2878 23.3841 11.5792 3.6749 0.7601 6.0377 6.4795 3.3414 1.0918 12.6838 4.8161 2.7276 6.1146 17.4311 11.4265 3.6502 1.9846 77.1074 27.6076 10.2355 7.2981 141.7372 0.4197 90.8562 98.6440 0.1182 0.2118 1.6392 4.9850 0.6158 0.1968 0.9521 2.2980 23.7038 7.6173 2.6732 0.6305 0.3648 8.7998 6.0498 19.8674 24.5805 14.9794 14.1469 14.8738 11.2402 2.2636 0.1930 2.6164 4.1002 59.3334 13.9466 2.4484 8.4491 12.7985 32.5110 3.6776 10.6381 3.8008 5.5670 136.4513 53.0859 7.7298 1.0745 55.1686 1.1269 29.2396 15.8108 20.3503 10.5754 12.8122 52.5456 87.2792 31.7922 19.0981 56.8286 21.3162 30.9259 19.3685 32.4737 21.0388 41.5732 52.8979 28.1211 65.7350 58.7789 84.4381 44.0612 25.8750 80.4912 16.4394 21.5798 20.7031 26.1846 23.0513 18.1123 4.8414 5.9752
temp: 298.150 k
press: 1.00000 atm
elementType: 8 6 6 6 6 6 6 6 6 6 6 6 6 6 6 6 6 6 6 6 6 6 6 6 1 1 1 1 1 1 1 1 1 1 1 1 1 1 1 1 1 1 1 1 1 1 1 1 1 1 1 1 1 1 1 1
symmnumber: 1
zpe: 1278698.5 jmol-1
zpe.correction: 0.487031 hartree
zpe.thermalcorrener: 0.512205 hartree
zpe.thermalcorrenthalpy: 0.513149 hartree
zpe.thermalcorrgfe: 0.429111 hartree
zpe.sumelectzpe: -969.047655 hartree
zpe.sumelectthermal: -969.022481 hartree
zpe.sumelectthermalent: -969.021536 hartree
zpe.sumelectthermalfe: -969.105574 hartree
dipole: 0.3693 -1.1525 0.6708
dipole: 1.3837
quadrupole: -130.9801 -144.6623 -145.9407
quadrupole: 1.0958 1.0668 -6.8508
quadrupole: 9.5476 -4.1346 -5.4130 1.0958 1.0668 -6.8508
hfenergy: -969.5346858 hartree
pointgroup: C01 [X(C23H32O1)]
dipole: -0.1505168 0.4016495 0.3352121 debye
polarizability: 381.3014506|12.4601741|198.564206|-6.0287224|25.9496461|201.0496945 unknown
InChI: InChI=1S/C23H32O/c1-5-18(4)22-12-8-21(9-13-22)17-24-23-14-10-20(11-15-23)16-19(6-2)7-3/h8-15,18-19H,5-7,16-17H2,1-4H3
charge 0 multiplicity 1
56 atoms
O  -0.363811 0.026341 -0.366442
C  6.160029 0.234383 0.426107
C  5.358364 0.722698 -0.824937
C  7.640647 0.689187 0.309437
C  5.998241 -1.291837 0.68014
C  3.849904 0.564323 -0.700507
C  -6.921668 -0.286564 -0.169531
C  8.511724 0.354606 1.53981
C  6.644102 -2.21367 -0.380264
C  -5.428685 0.010562 -0.005124
C  -7.438361 -1.324626 0.870364
C  3.093496 1.43819 0.118544
C  3.149447 -0.468335 -1.38069
C  -7.761831 1.01727 -0.105331
C  1.021829 0.263194 -0.426769
C  1.694487 1.301136 0.265231
C  1.756008 -0.62366 -1.251109
C  -4.915143 0.553231 1.202031
C  -4.512739 -0.244588 -1.056608
C  -2.635422 0.585516 0.284768
C  -6.765222 -2.708625 0.755839
C  -1.173603 0.955621 0.437864
C  -3.539673 0.830538 1.347574
C  -3.135951 0.040392 -0.920832
H  5.724935 0.751714 1.309988
H  5.606197 1.79206 -0.983725
H  5.721186 0.183365 -1.721517
H  7.652998 1.787146 0.148592
H  8.095214 0.244231 -0.599153
H  4.916923 -1.52067 0.748659
H  6.426237 -1.534631 1.672653
H  -7.064587 -0.732247 -1.17611
H  9.523385 0.78958 1.439063
H  8.630874 -0.735815 1.674267
H  8.06157 0.759493 2.466393
H  6.462742 -3.275386 -0.13098
H  7.73846 -2.067879 -0.439232
H  6.227253 -2.036227 -1.388951
H  -7.288321 -0.920264 1.892051
H  -8.533892 -1.431921 0.736856
H  3.603734 2.251079 0.65089
H  3.705659 -1.159983 -2.025404
H  -7.67318 1.498035 0.886998
H  -8.832237 0.801548 -0.281965
H  -7.425221 1.747411 -0.863126
H  -5.592617 0.752803 2.041288
H  -4.884237 -0.673674 -1.995677
H  1.151783 2.000173 0.908493
H  1.217994 -1.418406 -1.777282
H  -5.674357 -2.636175 0.915267
H  -6.929646 -3.147696 -0.246676
H  -7.173114 -3.413458 1.503558
H  -0.866827 0.90345 1.503011
H  -0.991285 1.9916 0.076555
H  -3.167379 1.238535 2.296275
H  -2.439209 -0.174574 -1.736819
