program: Gaussian 09
title: 000183753
version: EM64L-G09RevD.01
frameworkgroup: C1[X(C20H30O3)]
method: RPBEPBE
basis: SDD
operation: Freq
keyword: #pfreq=noraman
keyword: PBEPBE/SDD
title: #p freq=noraman PBEPBE/SDD
converged: YES YES NO NO
title: Mulliken charges:
elementType: O O O C C C C C C C C C C C C C C C C C C C C H H H H H H H H H H H H H H H H H H H H H H H H H H H H H H
charge: -0.450124 -0.470935 -0.491951 -0.029883 0.259328 0.293454 -0.563907 -0.483632 -0.550713 -0.102438 0.117752 -0.605563 -0.810401 0.375831 -0.765248 -0.775483 0.013729 -0.731485 0.558146 -0.128018 -0.285510 -0.685443 -0.685295 0.176635 0.215801 0.261315 0.212414 0.214546 0.207746 0.217892 0.200153 0.221324 0.225448 0.208383 0.216341 0.263221 0.211213 0.228147 0.215884 0.209224 0.219980 0.215377 0.238402 0.328900 0.231440 0.389912 0.366396 0.187251 0.221174 0.241580 0.241839 0.220027 0.189822
chargesum: 0.00000
title: Mulliken charges with hydrogens summed into heavy atoms:
elementType: O O O C C C C C C C C C C C C C C C C C C C C
charge: -0.121224 -0.081022 -0.125555 0.146752 0.259328 0.293454 -0.086791 -0.056672 -0.125075 0.097716 0.117752 -0.158791 -0.122456 0.375831 -0.110004 -0.130901 0.013729 -0.493084 0.558146 -0.128018 -0.054069 -0.035438 -0.033607
polarizability: 2.90383688e+02 3.18668381e+00 2.21318769e+02 -3.80931458e+00 5.74246246e+00 1.63946527e+02
1716.lowfreq: -13.2200 -1.5387 -0.0005 0.0006 0.0007 5.6380 32.9700 46.2313 67.2442
frequency: 32.9273 46.1833 67.2411 84.7300 106.5373 114.6424 124.2954 138.9967 151.0627 162.8831 176.3418 190.4526 199.4705 213.5559 214.6406 223.7581 227.3118 242.1680 267.7060 273.1564 289.2312 298.7855 306.6378 312.1034 323.4336 335.3441 339.3040 350.0642 371.1722 380.5990 400.3739 423.2562 431.4935 455.6050 480.1424 481.2355 503.4336 522.2060 528.9782 554.1157 574.7492 594.2065 596.7365 650.3038 669.5701 706.8447 735.3585 759.0473 784.2668 818.0156 848.1348 865.1220 875.1088 883.1320 899.1405 911.4832 913.8636 930.4776 948.8826 950.9144 953.9034 963.0006 975.0197 981.9090 999.2390 1009.7095 1028.6576 1043.0900 1058.3453 1078.3007 1088.6542 1104.5372 1113.0175 1116.4342 1135.3227 1148.2466 1157.4119 1169.9217 1182.9737 1189.5059 1205.0799 1212.7054 1221.0209 1228.4997 1234.6287 1254.8872 1272.0274 1283.1335 1285.3825 1302.4833 1305.0639 1310.3624 1314.9409 1332.2618 1336.6477 1350.4394 1353.5999 1363.6311 1375.3585 1385.7345 1389.5597 1393.7378 1398.3356 1402.0280 1404.1716 1438.6727 1454.3012 1456.9131 1460.8311 1461.3980 1466.1881 1472.5876 1472.9517 1476.3997 1476.8245 1482.4276 1483.0759 1487.1911 1492.0624 1492.8572 1505.7591 1579.6372 1631.4721 2912.2684 2952.2756 2953.6520 2966.3957 2966.7688 2970.7208 2973.0809 2979.3677 2985.6258 2989.8499 2995.5726 2998.6351 3018.0319 3036.7360 3051.3407 3055.1071 3058.7857 3060.7609 3063.6849 3067.0362 3068.4502 3083.6413 3085.9895 3086.9071 3091.7873 3105.4838 3105.8361 3471.7821 3548.2451 3637.3208
redmass: 3.8353 3.4431 2.2923 2.0946 2.6123 2.6552 2.1008 2.2182 1.5115 2.8781 2.0002 1.7180 3.0671 1.5344 1.4478 1.1213 1.5593 3.0253 2.3149 2.8339 2.4324 2.3931 2.1840 1.3836 2.6547 3.3184 4.0423 3.3175 3.6161 3.7459 2.7180 2.8972 4.0924 2.1741 3.1894 3.8246 2.4344 2.9960 1.1519 4.7768 3.3941 3.0073 3.8481 3.8128 5.3531 3.9421 3.9593 5.5859 2.6400 2.9957 1.7489 1.5086 2.3266 1.9178 2.2086 2.5672 1.2268 1.5879 2.2768 1.9839 1.3962 2.1676 2.0279 2.1197 2.1714 2.0521 1.7088 2.0841 2.0046 1.6815 1.9333 2.3401 2.6000 1.6428 1.8278 2.0432 1.7308 2.0363 1.9028 1.9079 1.5693 3.7236 1.5852 1.7255 1.7612 1.6930 1.7732 1.6120 1.4933 1.3740 1.3039 1.3008 1.6137 1.3887 1.5621 1.4629 2.1376 1.5213 1.2142 1.1851 1.2071 3.3128 1.2177 1.3359 1.5412 2.6928 1.0862 1.1597 1.0507 1.0564 1.0712 1.0740 1.0611 1.0888 1.1174 1.1361 1.0659 1.1106 1.5483 1.3000 1.0592 7.5725 7.1505 1.0818 1.0642 1.0818 1.0363 1.0388 1.0401 1.0575 1.0401 1.0644 1.0812 1.0462 1.0576 1.0876 1.1014 1.0960 1.1006 1.0994 1.0959 1.0984 1.0982 1.0972 1.1003 1.0989 1.0999 1.0983 1.0916 1.0941 1.0641 1.0658 1.0661
irintensity: 0.8950 0.3254 9.4432 33.3055 31.8734 0.6146 42.6013 1.9397 0.1387 0.1483 0.2345 1.8790 1.0804 21.7286 1.0779 14.4588 13.8875 6.4034 3.9468 8.4671 11.6115 3.8756 23.8534 96.5885 5.7376 3.7088 2.8357 0.9105 5.9860 1.2162 3.1920 1.3113 0.7110 4.6117 4.2405 2.1635 0.3210 3.6124 98.4085 1.5796 0.8484 2.6119 2.5126 6.7238 3.3789 3.4881 11.8080 1.4675 19.9439 13.5252 11.5393 5.6519 26.4938 12.3950 28.9150 2.0885 1.6543 2.1751 29.7022 8.2110 0.2268 27.5693 5.8765 26.6178 34.9979 23.9458 6.5794 21.7941 7.8472 25.6871 8.8098 4.1739 3.1903 4.9227 1.8891 30.1283 36.7114 86.2493 3.4041 11.4940 19.2546 11.4022 10.7975 33.4587 10.8760 77.1555 140.1520 49.7127 12.4392 2.7018 8.5633 1.2099 17.9982 3.6327 0.7007 16.6677 9.7728 6.5645 13.2555 16.6914 26.8650 7.8227 24.3368 33.3773 0.9157 49.6416 7.1671 13.9187 3.1173 1.1198 3.5850 6.8224 3.9294 0.9077 3.9555 11.9669 7.3858 30.7351 30.8496 1.8599 15.4280 2.4407 3.2983 23.1535 31.2702 24.9152 22.7154 22.7786 37.4646 32.4478 33.2970 41.4996 11.4553 8.2845 48.5926 48.3358 33.3621 9.4242 22.8454 34.2641 105.3157 73.4548 42.0156 23.7477 16.2114 16.3698 46.9386 39.1046 47.7165 19.1828 77.6745 3.5367 67.0079
temp: 298.150 k
press: 1.00000 atm
elementType: 8 8 8 6 6 6 6 6 6 6 6 6 6 6 6 6 6 6 6 6 6 6 6 1 1 1 1 1 1 1 1 1 1 1 1 1 1 1 1 1 1 1 1 1 1 1 1 1 1 1 1 1 1
symmnumber: 1
zpe: 1201089.9 jmol-1
zpe.correction: 0.457471 hartree
zpe.thermalcorrener: 0.481867 hartree
zpe.thermalcorrenthalpy: 0.482811 hartree
zpe.thermalcorrgfe: 0.406488 hartree
zpe.sumelectzpe: -1004.014553 hartree
zpe.sumelectthermal: -1003.990157 hartree
zpe.sumelectthermalent: -1003.989213 hartree
zpe.sumelectthermalfe: -1004.065536 hartree
dipole: 4.6124 -1.5661 0.7836
dipole: 4.9336
quadrupole: -128.8124 -136.0335 -145.2049
quadrupole: 7.0424 -6.6154 4.2622
quadrupole: 7.8712 0.6501 -8.5213 7.0424 -6.6154 4.2622
hfenergy: -1004.4720244 hartree
pointgroup: C01 [X(C20H30O3)]
dipole: -1.822737 -0.5921299 -0.3076331 debye
polarizability: 290.3033194|-4.4182206|221.1357522|-2.8458021|-7.1154424|164.2099137 unknown
InChI: InChI=1S/C20H30O3/c1-11(2)14-8-12-6-7-15-19(3,4)9-13(21)10-20(15,5)16(12)18(23)17(14)22/h8,11,13,15,21-23H,6-7,9-10H2,1-5H3
charge 0 multiplicity 1
53 atoms
O  3.683062 2.89929 1.075851
O  -0.841723 2.389897 -0.739368
O  -3.385774 2.07581 -0.368658
C  2.027912 -0.937073 0.169336
C  1.228718 0.289246 -0.424499
C  3.600073 -0.827611 0.177368
C  1.720953 1.553531 0.35602
C  4.004529 0.533273 0.824576
C  1.470818 -2.26488 -0.389321
C  3.247135 1.738687 0.263439
C  -0.289851 0.043768 -0.19973
C  0.065293 -2.486321 0.198395
C  1.400382 0.507587 -1.963261
C  -0.824707 -1.25088 0.085642
C  4.265964 -1.004153 -1.216525
C  4.173981 -1.944306 1.100792
C  -1.237046 1.092117 -0.357528
C  -2.218098 -1.431697 0.260208
C  -3.158751 -0.381003 0.152988
C  -2.62721 0.884581 -0.171849
C  -4.652804 -0.648463 0.361847
C  -5.495553 -0.420494 -0.925125
C  -5.236569 0.123083 1.578781
H  1.763108 -0.928065 1.25328
H  1.45214 1.450474 1.42695
H  1.207153 2.45192 -0.027029
H  5.094206 0.694346 0.712263
H  3.793963 0.49788 1.91303
H  2.118579 -3.11714 -0.116364
H  1.423374 -2.239303 -1.494655
H  3.537177 1.920081 -0.793695
H  0.170036 -2.764428 1.268508
H  -0.438051 -3.340635 -0.294746
H  2.419213 0.824633 -2.235411
H  1.165703 -0.411077 -2.52895
H  0.706559 1.298259 -2.296901
H  5.358535 -1.130077 -1.092652
H  3.882269 -1.904806 -1.730458
H  4.109196 -0.14204 -1.884367
H  4.088826 -2.948392 0.646628
H  5.24812 -1.759201 1.29124
H  3.655572 -1.962045 2.078381
H  -2.589015 -2.44063 0.483553
H  3.149958 3.688096 0.79841
H  -4.739659 -1.725944 0.603161
H  -1.666765 2.945539 -0.795885
H  -4.351133 1.916557 -0.2541
H  -5.523311 0.640459 -1.244673
H  -6.542209 -0.736387 -0.76064
H  -5.084956 -1.001273 -1.769672
H  -4.657762 -0.094916 2.493355
H  -6.288294 -0.169958 1.753123
H  -5.220965 1.222385 1.440939
