program: Gaussian 09
title: 000183731
version: EM64L-G09RevD.01
frameworkgroup: C1[X(C20H26O2)]
method: RPBEPBE
basis: SDD
operation: Freq
keyword: #pfreq=noraman
keyword: PBEPBE/SDD
title: #p freq=noraman PBEPBE/SDD
converged: YES YES NO NO
title: Mulliken charges:
elementType: O O C C C C C C C C C C C C C C C C C C C C H H H H H H H H H H H H H H H H H H H H H H H H H H
charge: -0.307274 -0.267910 0.015822 -0.620322 -0.394455 -0.412443 0.529679 -0.718813 -0.714727 -0.428703 -0.380440 -0.367059 -0.398960 0.323897 0.323493 -0.360423 -0.362742 0.335487 -0.336593 -0.343875 -0.242938 -0.685045 0.200517 0.208824 0.204340 0.194853 0.203550 0.218571 0.207309 0.211739 0.221627 0.214830 0.214018 0.221194 0.214833 0.228496 0.232142 0.262535 0.252581 0.262670 0.257529 0.245722 0.251984 0.205794 0.207388 0.232056 0.232545 0.206696
chargesum: 0.00000
title: Mulliken charges with hydrogens summed into heavy atoms:
elementType: O O C C C C C C C C C C C C C C C C C C C C
charge: -0.307274 -0.267910 0.216339 -0.207157 0.003947 0.013437 0.529679 -0.070617 -0.064682 -0.200208 -0.148298 -0.104524 -0.146379 0.323897 0.323493 -0.097753 -0.105213 0.335487 -0.090871 -0.091891 0.170245 -0.013747
polarizability: 3.44973618e+02 -1.30738684e+01 2.08075832e+02 -8.10143173e+00 6.64143217e+00 1.51289716e+02
1716.lowfreq: -26.9379 -3.4206 -0.0011 -0.0009 0.0008 3.0780 10.0669 20.0471 22.7192
frequency: -19.8732 19.4118 22.6032 39.2667 49.9370 58.4715 67.5704 79.6171 115.7488 116.9772 132.7031 156.7750 164.5981 197.0703 215.0712 218.9355 244.9401 257.2404 281.2243 291.5173 317.3031 328.2156 353.0776 359.3767 387.5623 412.4772 418.2902 434.4306 460.9511 495.6502 512.7861 523.8335 555.5599 592.4276 628.3939 633.5285 690.2475 709.7316 728.2949 744.8320 755.2981 769.4416 797.1229 800.4478 808.7713 828.4458 830.5670 835.0227 846.2255 855.8390 895.9263 903.5547 927.4953 933.7741 950.5745 954.5057 964.7425 966.0908 997.1074 1004.7030 1005.8032 1026.7620 1038.2470 1055.5955 1077.5076 1106.0551 1117.5427 1119.4836 1136.6048 1148.8595 1150.9190 1153.3781 1170.9966 1183.1803 1184.1052 1202.3163 1216.6760 1237.7094 1247.2606 1263.3094 1270.3504 1275.6439 1291.0368 1300.4041 1318.9664 1336.7645 1346.4353 1354.9511 1360.8347 1373.4096 1383.5747 1387.2793 1389.3122 1400.6903 1412.8910 1421.3689 1461.1686 1462.2937 1468.2971 1474.8529 1477.0695 1480.3124 1482.6791 1483.5977 1485.8818 1492.0884 1494.0539 1497.5802 1582.2886 1592.9953 1614.8455 1622.2671 2942.3716 2950.4335 2963.8979 2971.4286 2973.7299 2978.4597 2986.4150 2997.2279 3007.6548 3011.3502 3027.6044 3029.3239 3067.0099 3069.1889 3071.6022 3074.3911 3094.4607 3106.1072 3120.7244 3124.1578 3147.0544 3156.1954 3159.9912 3165.1491 3167.9835 3177.1851
redmass: 3.4204 3.5720 3.7606 3.5166 4.0579 3.8678 2.7072 3.4630 1.7006 1.7854 3.6978 4.6434 4.6193 2.2490 2.2787 1.1593 1.1852 3.0702 3.9308 2.1397 2.9880 2.9553 4.8541 3.6016 3.5905 2.9577 3.0600 4.1364 2.8378 3.0821 2.4983 2.2667 5.5104 3.9836 6.5310 6.6725 4.6023 3.6288 3.4508 1.7618 1.7761 2.6325 1.5289 1.4709 2.1592 1.1937 1.3478 1.3639 1.8560 6.1562 1.5975 3.2176 1.4145 1.5779 1.4612 1.3439 1.3561 2.1250 2.6612 1.5629 2.2660 1.7353 2.8693 2.4415 1.4982 1.3372 1.9840 1.3783 1.4419 2.0179 2.0201 2.2682 1.1998 1.7318 1.2896 2.2410 2.8427 6.7437 1.2823 1.1392 1.2706 1.1076 1.2899 1.2952 1.4386 1.5356 1.4757 1.4000 2.1733 2.1555 3.9843 1.2301 1.2126 1.3043 3.3026 3.7956 1.0399 1.0723 1.0671 1.3048 1.0631 1.0753 1.3685 1.0502 1.0579 1.5288 1.0745 1.9392 7.2513 7.6950 6.4954 6.5247 1.0811 1.0553 1.0598 1.0589 1.0369 1.0378 1.0620 1.0362 1.1075 1.1002 1.1001 1.0994 1.0994 1.0992 1.0993 1.0997 1.0989 1.1013 1.0893 1.0891 1.0879 1.0881 1.0942 1.0953 1.0958 1.0975
irintensity: 0.3507 0.9516 0.1237 0.4155 0.4239 0.8204 0.3653 0.0698 0.0164 3.0446 0.4189 1.4061 0.2390 0.1066 0.8863 0.1389 0.8074 0.8135 1.1522 0.3595 0.1711 1.0983 4.6172 0.5027 6.9720 0.7820 0.2427 0.1854 2.6231 11.6486 20.0494 21.8275 2.0527 5.0360 0.1554 4.0860 5.3887 2.1333 7.4397 6.2737 27.6045 4.5272 31.2778 11.7941 2.2352 23.2412 22.8955 33.3281 24.7001 51.3726 3.5683 37.2165 4.0392 6.2592 0.2425 0.1342 0.3641 1.8703 16.3358 6.2239 8.3307 7.7693 70.2930 1.9391 6.9119 14.2052 9.1637 12.2298 4.5121 11.6223 4.2536 2.7210 12.6219 285.9741 3.5001 493.9100 38.3030 67.9540 0.1245 0.0308 1.5940 5.1244 0.6827 3.1530 2.4664 0.9669 1.3162 0.2139 7.5092 7.9207 7.2666 22.9615 13.0524 46.1883 4.4986 2.7560 11.7225 0.5329 3.9550 239.1222 10.5149 32.0181 226.3537 4.4955 9.4926 116.2845 8.3809 32.8457 3.3881 1.3850 22.1456 25.7368 14.7412 37.3763 17.4045 61.4099 31.8449 47.1228 23.1922 28.3418 38.4501 16.8787 24.2953 42.0057 51.5690 48.3559 99.4596 36.3662 28.3983 34.3159 15.8893 27.8124 17.9609 6.0009 7.4648 4.4727 8.8777 3.3272
temp: 298.150 k
press: 1.00000 atm
elementType: 8 8 6 6 6 6 6 6 6 6 6 6 6 6 6 6 6 6 6 6 6 6 1 1 1 1 1 1 1 1 1 1 1 1 1 1 1 1 1 1 1 1 1 1 1 1 1 1
symmnumber: 1
zpe: 1069592.5 jmol-1
zpe.correction: 0.407386 hartree
zpe.thermalcorrener: 0.429421 hartree
zpe.thermalcorrenthalpy: 0.430365 hartree
zpe.thermalcorrgfe: 0.354239 hartree
zpe.sumelectzpe: -926.508253 hartree
zpe.sumelectthermal: -926.486218 hartree
zpe.sumelectthermalent: -926.485274 hartree
zpe.sumelectthermalfe: -926.561401 hartree
dipole: 0.2585 2.8337 -0.1536
dipole: 2.8496
quadrupole: -120.2179 -127.6537 -134.5726
quadrupole: -12.1305 0.3505 -0.1207
quadrupole: 7.2635 -0.1723 -7.0912 -12.1305 0.3505 -0.1207
hfenergy: -926.9156397 hartree
pointgroup: C01 [X(C20H26O2)]
dipole: 0.148093 -1.1094141 -0.0647701 debye
polarizability: 343.2094646|17.2660446|206.994286|13.7724769|13.77626|154.1354157 unknown
InChI: InChI=1S/C20H26O2/c1-4-16(5-2)15-17-7-9-19(10-8-17)22-20-13-11-18(12-14-20)21-6-3/h7-14,16H,4-6,15H2,1-3H3
charge 0 multiplicity 1
48 atoms
O  -1.159608 1.811455 0.632625
O  -5.903341 -1.073975 -0.344839
C  5.029198 -0.395291 0.3108
C  4.306045 0.512343 -0.736989
C  6.547848 -0.456841 -0.009679
C  4.364837 -1.795693 0.444352
C  2.855918 0.825257 -0.398197
C  7.388619 -1.240344 1.02162
C  4.490545 -2.711416 -0.795225
C  1.782075 0.279941 -1.145799
C  2.534641 1.678974 0.691713
C  0.434058 0.559591 -0.826487
C  1.198146 1.967985 1.03126
C  0.149058 1.40245 0.271646
C  -2.287062 0.999376 0.335091
C  -2.303083 -0.396345 0.540732
C  -3.458086 1.676272 -0.076749
C  -4.667886 -0.452029 -0.097908
C  -3.49265 -1.127284 0.319086
C  -4.645116 0.953032 -0.28943
C  -5.989491 -2.53285 -0.142858
C  -7.423758 -2.940551 -0.469213
H  4.921525 0.102144 1.300328
H  4.3644 0.032761 -1.733343
H  4.880713 1.458103 -0.812919
H  6.931297 0.582692 -0.070624
H  6.696257 -0.894526 -1.017948
H  3.29245 -1.65074 0.679859
H  4.803339 -2.315061 1.319017
H  7.241552 -0.837724 2.042047
H  7.118552 -2.311797 1.0418
H  8.466809 -1.17349 0.785671
H  3.982625 -3.676888 -0.615992
H  5.546772 -2.930761 -1.037023
H  4.027771 -2.256746 -1.690369
H  1.999984 -0.37012 -2.002245
H  3.343535 2.128794 1.280702
H  -0.377186 0.141013 -1.429923
H  0.94801 2.629415 1.86633
H  -1.399499 -0.912866 0.879776
H  -3.423236 2.760458 -0.217784
H  -3.487493 -2.208551 0.483672
H  -5.564413 1.454338 -0.606322
H  -5.264492 -3.042517 -0.811297
H  -5.731507 -2.776274 0.90884
H  -7.673351 -2.683836 -1.512819
H  -8.136059 -2.422367 0.195107
H  -7.54876 -4.030613 -0.336192
