program: Gaussian 09
title: 000183730
version: EM64L-G09RevD.01
frameworkgroup: C1[X(C18H24N2O2)]
method: RPBEPBE
basis: SDD
operation: Freq
keyword: #p
keyword: freq=noraman
keyword: PBEPBE/SDD
title: #p freq=noraman PBEPBE/SDD
converged: YES YES NO NO
title: Mulliken charges:
elementType: O O N N C C C C C C C C C C C C C C C C C C H H H H H H H H H H H H H H H H H H H H H H H H
charge: -0.264143 -0.205791 -0.068197 -0.003351 0.013466 -0.624911 -0.409857 -0.396774 0.515480 -0.718357 -0.715190 -0.412316 -0.412921 -0.382351 -0.355311 0.344613 -0.289379 -0.289421 0.055773 -0.259708 -0.277798 -0.176343 0.206568 0.202652 0.211565 0.209221 0.192987 0.190983 0.226983 0.221642 0.225902 0.213315 0.216057 0.210707 0.215943 0.233990 0.228306 0.247726 0.241641 0.199833 0.229560 0.249399 0.215632 0.250193 0.252565 0.239416
chargesum: 0.00000
title: Mulliken charges with hydrogens summed into heavy atoms:
elementType: O O N N C C C C C C C C C C C C C C C C C C
charge: -0.264143 -0.205791 -0.068197 -0.003351 0.220034 -0.210694 -0.007649 0.021193 0.515480 -0.057498 -0.072482 -0.178326 -0.184615 -0.134625 -0.113669 0.344613 0.140014 0.175611 0.055773 -0.009515 -0.025233 0.063072
polarizability: 3.17005634e+02 -5.81359111e+00 1.80027557e+02 -1.15882373e+01 8.44607128e+00 1.60823111e+02
1716.lowfreq: -5.6773 -0.0007 -0.0001 0.0009 2.4336 3.6367 13.7849 19.3611 22.4937
frequency: 13.5734 19.1625 22.4756 39.5476 46.2535 51.8583 76.9703 89.5145 100.6464 112.6576 132.9309 167.7795 176.0192 193.2183 207.2864 220.9191 236.5730 265.4323 282.4479 308.0327 335.2752 340.6482 407.1059 410.1309 416.4119 422.9263 455.6112 462.2536 509.3183 517.7882 528.4206 581.8628 614.9143 633.1010 636.6662 708.3274 740.1114 746.0469 772.7279 783.7197 785.9106 804.6056 808.3423 814.9538 821.4951 843.5116 880.3581 897.0663 914.8799 931.3825 940.6038 949.7639 953.8280 961.4814 968.7673 974.7266 1004.1848 1005.3282 1020.4104 1028.3060 1039.2796 1056.2631 1058.5902 1083.1911 1083.7809 1108.9039 1119.6920 1133.1319 1149.9319 1180.8683 1203.6689 1204.7278 1215.7211 1224.1200 1238.7662 1249.3507 1255.1733 1259.8838 1264.4652 1283.2546 1301.6475 1304.0713 1312.5277 1332.8824 1346.0483 1353.6281 1357.3963 1371.9383 1387.6835 1390.3654 1394.5823 1397.6661 1409.4862 1416.5232 1453.0126 1459.9781 1465.1618 1468.5431 1474.8287 1478.8263 1484.9197 1488.2130 1494.2053 1500.8989 1514.9252 1549.9942 1583.8526 1623.1110 2939.5231 2958.7032 2966.9765 2970.0624 2971.6437 2973.4684 2980.8946 3015.7627 3018.6006 3023.3580 3028.5978 3030.4939 3066.2179 3070.4229 3071.0194 3076.8655 3091.7733 3116.3234 3123.5041 3140.2451 3142.3391 3157.4318 3164.8806 3190.5060
redmass: 5.2408 3.6744 5.3863 3.9137 3.4277 4.0273 2.7735 4.8852 2.6382 4.5192 3.3908 3.0748 3.3876 3.2726 2.6016 1.0839 2.5074 2.3341 1.9161 2.3525 4.3174 2.1240 3.9908 3.1176 3.2718 3.5437 4.9704 3.1524 2.6559 2.7902 2.4825 4.1844 6.7171 6.6683 5.5841 2.8912 2.9052 1.8262 1.5356 4.3549 3.8208 1.5707 1.4407 1.7515 1.6768 1.8754 1.9162 3.5195 4.5316 1.4017 1.5219 5.7312 1.3758 1.4291 1.8966 1.4477 2.6404 1.4313 2.6377 1.8140 2.5831 2.3901 2.5903 1.5205 1.5904 2.1471 1.6780 1.4795 1.9300 1.2375 1.5176 1.1243 2.0802 4.3613 2.8714 1.2896 1.2622 1.2298 2.2344 1.1858 1.3225 3.0309 1.3146 1.5349 1.4559 1.4600 1.4494 2.5329 1.2511 1.8564 1.2785 1.6556 2.0491 3.1914 1.1250 1.1216 1.0600 1.0783 1.0842 1.0625 1.0441 1.0498 1.0699 2.4800 5.7448 4.9625 6.9819 6.4774 1.0796 1.0577 1.0609 1.0510 1.0613 1.0474 1.0386 1.0677 1.0988 1.0985 1.0958 1.0999 1.0996 1.0993 1.0992 1.0999 1.1047 1.0890 1.0893 1.0901 1.0932 1.0935 1.0952 1.0990
irintensity: 0.3828 0.0657 2.3372 0.0229 0.1576 0.1123 0.0999 2.6108 1.0457 2.8685 0.2702 6.7088 1.8604 1.2486 0.6844 0.2553 2.2254 2.1325 0.3723 0.1089 3.0492 0.4410 0.4115 0.8622 3.0067 0.7367 7.3877 1.2972 0.6337 1.0354 19.0172 12.1301 8.4776 0.4142 16.8327 2.0690 11.5694 11.5000 1.7150 0.2064 1.4365 29.2699 65.4552 1.5864 1.3223 36.8260 1.7079 28.7532 54.2449 7.5936 9.9099 68.7046 0.0830 2.0825 2.7353 0.6916 7.3412 3.1698 50.9634 4.9598 18.8825 0.6107 4.0646 8.7755 4.3161 7.5345 4.6079 9.3730 6.5615 74.4502 4.2729 3.8305 136.1447 245.6531 4.4424 3.7559 4.7938 3.0273 20.6602 0.9513 0.5469 359.0845 1.6854 0.9897 4.8961 45.4602 0.8196 21.9260 14.8152 30.0893 21.7372 32.8828 318.3542 2.9426 5.0384 51.9667 5.2502 12.5326 2.0298 20.0265 3.2564 8.5638 8.6947 139.1993 79.1975 166.1554 5.4406 43.7593 14.8278 40.0236 34.7609 27.3590 41.1685 52.7190 30.6540 13.4731 25.6371 18.0946 42.9205 35.6014 53.1749 92.6726 24.0022 58.5541 16.6700 20.0332 22.4931 16.8131 19.1140 18.0271 5.2998 16.1178
temp: 298.150 k
press: 1.00000 atm
elementType: 8 8 7 7 6 6 6 6 6 6 6 6 6 6 6 6 6 6 6 6 6 6 1 1 1 1 1 1 1 1 1 1 1 1 1 1 1 1 1 1 1 1 1 1 1 1
symmnumber: 1
zpe: 1010341.3 jmol-1
zpe.correction: 0.384819 hartree
zpe.thermalcorrener: 0.407031 hartree
zpe.thermalcorrenthalpy: 0.407975 hartree
zpe.thermalcorrgfe: 0.329380 hartree
zpe.sumelectzpe: -958.580484 hartree
zpe.sumelectthermal: -958.558271 hartree
zpe.sumelectthermalent: -958.557327 hartree
zpe.sumelectthermalfe: -958.635923 hartree
dipole: -2.1984 -1.4176 -0.6091
dipole: 2.6858
quadrupole: -92.9306 -132.3145 -128.1912
quadrupole: -0.5148 -3.9870 6.9087
quadrupole: 24.8815 -14.5024 -10.3791 -0.5148 -3.9870 6.9087
hfenergy: -958.9653027 hartree
pointgroup: C01 [X(C18H24N2O2)]
dipole: -0.8536257 0.5796342 0.2279102 debye
polarizability: 317.3631845|4.0537242|180.4196112|10.1133518|7.5441715|160.0735067 unknown
InChI: InChI=1S/C18H24N2O2/c1-3-15(4-2)14-16-6-8-17(9-7-16)21-12-13-22-18-19-10-5-11-20-18/h5-11,15H,3-4,12-14H2,1-2H3
charge 0 multiplicity 1
46 atoms
O  -1.079715 1.018459 -0.319398
O  -3.673628 -0.07138 0.694344
N  -5.817789 0.582685 -0.043952
N  -5.252843 -1.737482 0.500954
C  5.263413 -0.490633 0.493985
C  4.693899 0.712223 -0.3280
C  6.797858 -0.343285 0.709151
C  4.853024 -1.846584 -0.13989
C  3.174904 0.812123 -0.307268
C  7.657822 -0.417915 -0.574077
C  5.264292 -3.085399 0.685679
C  2.39004 0.447003 -1.434362
C  2.491117 1.260244 0.849658
C  0.984343 0.521261 -1.409688
C  1.080925 1.343699 0.8981
C  0.324545 0.970254 -0.240503
C  -1.811048 1.446655 0.878172
C  -3.293304 1.358672 0.564756
C  -4.966209 -0.406441 0.366092
C  -7.085037 0.182668 -0.359284
C  -6.525973 -2.094591 0.178506
C  -7.497369 -1.163105 -0.266725
H  4.793545 -0.444965 1.501657
H  5.13358 1.643927 0.083419
H  5.043802 0.631645 -1.375495
H  7.139395 -1.124532 1.416226
H  6.98649 0.627968 1.211897
H  5.282209 -1.921549 -1.160305
H  3.753405 -1.849569 -0.269464
H  7.542847 -1.391571 -1.084584
H  7.386001 0.375194 -1.294263
H  8.729504 -0.293709 -0.332265
H  6.362672 -3.194183 0.748216
H  4.872972 -3.019401 1.718963
H  4.863268 -4.011569 0.234117
H  2.890084 0.09923 -2.346547
H  3.06924 1.557854 1.733861
H  0.380502 0.237315 -2.277101
H  0.594505 1.69765 1.812292
H  -1.547228 2.49691 1.125113
H  -1.562775 0.797749 1.741464
H  -3.510224 1.714445 -0.456699
H  -3.889739 1.952954 1.281367
H  -7.768551 0.972376 -0.689778
H  -6.761411 -3.159388 0.284028
H  -8.513161 -1.471811 -0.522471
