program: Gaussian 09
title: 000183694
version: EM64L-G09RevD.01
frameworkgroup: C1[X(C8H8Br2Cl2N2)]
method: RPBEPBE
basis: SDD
operation: Freq
keyword: #p
keyword: freq=noraman
keyword: PBEPBE/SDD
title: #p freq=noraman PBEPBE/SDD
converged: YES YES NO NO
title: Mulliken charges:
elementType: Br Br Cl Cl N N C C C C C C C C H H H H H H H H
charge: 0.071504 0.075093 0.005716 0.018957 0.007635 0.005584 0.165996 0.603389 -0.768654 -0.670980 -0.707792 -0.213427 -0.426881 -0.276864 0.372948 0.232563 0.247945 0.243384 0.254762 0.240880 0.225678 0.292563
chargesum: 0.00000
title: Mulliken charges with hydrogens summed into heavy atoms:
elementType: Br Br Cl Cl N N C C C C C C C C
charge: 0.071504 0.075093 0.005716 0.018957 0.007635 0.005584 0.165996 0.603389 -0.395706 0.052912 0.013529 0.079136 -0.426881 -0.276864
polarizability: 2.01531380e+02 -2.59553027e+01 1.39838662e+02 -1.06623402e+01 -5.33242626e+00 1.15312437e+02
1716.lowfreq: -7.3229 -2.6434 -0.0017 0.0008 0.0012 9.0010 33.4931 38.6101 66.6179
frequency: 33.4510 38.5628 66.6105 90.6253 137.4025 150.4718 161.3546 178.8670 201.9249 222.6343 232.9496 255.2379 307.5966 317.2875 324.9664 348.4387 354.1601 408.1327 450.1952 465.7667 513.4194 542.8959 604.2224 636.7503 654.9794 668.9431 749.5611 787.1586 859.4350 906.0530 933.7797 951.0013 997.0701 1002.5573 1028.5198 1101.6879 1119.2018 1136.5070 1170.8301 1182.5626 1192.9833 1265.2275 1278.3602 1324.7123 1380.6354 1403.0540 1446.6579 1463.7504 1473.8798 1484.8892 1500.1920 1530.2291 2997.1279 3002.5289 3093.9268 3099.4661 3107.2386 3120.9678 3140.4842 3207.6893
redmass: 21.7931 15.2009 12.3974 16.2281 17.2123 6.7051 4.8913 6.0539 1.4397 5.9118 5.2303 2.5859 4.0787 18.6425 1.1525 4.8189 3.9071 3.3580 6.8175 5.0383 6.9094 6.5827 7.1338 5.3525 7.4225 5.5790 5.6842 6.0438 3.1664 1.6326 1.7091 1.8431 7.2537 1.3020 5.3340 2.6366 2.5533 2.7925 1.3409 2.3898 2.3385 1.6993 4.0902 2.3898 1.1738 1.1871 8.2396 1.0766 1.0580 1.0515 1.0528 5.4486 1.0365 1.0362 1.1003 1.0993 1.0984 1.1001 1.0875 1.0925
irintensity: 0.0469 1.1494 2.7926 0.4326 0.2364 2.8912 0.2405 0.0359 0.2790 2.1151 1.7312 1.6515 2.7702 0.1673 0.0666 3.2700 0.2073 1.2548 11.9853 2.5747 58.7859 14.9176 15.7318 29.9229 21.9242 44.9958 3.7116 2.4588 52.0992 1.4186 17.1124 10.2305 4.1583 3.4338 16.5892 85.0125 83.1225 33.1341 18.1314 20.1714 10.2498 2.6621 86.6109 78.2843 22.3200 30.1955 1.7146 2.9967 3.9811 16.8998 18.6363 54.9855 11.2922 17.5084 12.2599 11.7656 16.6516 7.3120 15.4034 0.6737
temp: 298.150 k
press: 1.00000 atm
elementType: 35 35 17 17 7 7 6 6 6 6 6 6 6 6 1 1 1 1 1 1 1 1
symmnumber: 1
zpe: 381655.2 jmol-1
zpe.correction: 0.145365 hartree
zpe.thermalcorrener: 0.160477 hartree
zpe.thermalcorrenthalpy: 0.161421 hartree
zpe.thermalcorrgfe: 0.100647 hartree
zpe.sumelectzpe: -1365.090532 hartree
zpe.sumelectthermal: -1365.075420 hartree
zpe.sumelectthermalent: -1365.074475 hartree
zpe.sumelectthermalfe: -1365.135250 hartree
dipole: -2.3267 -1.4566 3.9772
dipole: 4.8325
quadrupole: -135.6071 -118.1685 -112.7591
quadrupole: -8.8216 4.1139 1.9065
quadrupole: -13.4288 4.0097 9.4191 -8.8216 4.1139 1.9065
hfenergy: -1365.2358967 hartree
pointgroup: C01 [X(C8H8Br2Cl2N2)]
dipole: -1.0346174 -0.9868063 1.2532057 debye
dipolederiv: -0.759915 -0.0048157 0.1580467 -0.0724082 -0.051636 0.0077706 0.1138742 -0.0096231 -0.1554321 -0.2285868 0.0750292 0.1588997 0.0902728 -0.145127 -0.2490372 0.1374657 -0.1818968 -0.5508668 -0.4826437 0.3118785 -0.0583666 0.3325346 -0.4818282 0.0531071 -0.0604505 0.0543753 -0.0736211 -0.5496916 0.3635123 -0.0395694 0.4726789 -0.4509386 0.0519105 -0.0449561 0.0505276 -0.0487262 -0.3343767 0.3921258 -0.0822982 -0.2555209 -0.1512336 0.0148558 0.0855692 -0.052602 -0.1610584 -0.1811935 -0.12762 0.0170736 0.4961079 -0.3811602 -0.0026502 -0.122303 0.0716215 -0.1674975 -0.0467976 0.0957389 0.0952503 0.0571341 0.0591725 -0.1885075 0.1446345 -0.0399149 -0.0472361 0.3245526 0.2122445 -0.0390372 0.1836898 -0.1097112 0.0613469 -0.1680278 0.0215133 0.0141458 1.1422576 -0.0935785 -0.3303106 -0.1115268 0.0401044 0.3258858 -0.2191328 0.3108028 0.8345091 -0.1434074 -0.0500013 -0.0811241 -0.0705483 -0.0078057 0.0882015 -0.0000232 -0.0331728 -0.0553673 -0.0723644 -0.030819 -0.0104109 -0.0448087 -0.0764211 0.0163151 -0.004016 0.0494602 -0.0157438 -0.4579817 0.10699 -0.0113136 0.1422207 -0.0942783 -0.0009476 0.0080113 0.0119258 -0.0156599 0.5952329 -0.7357957 0.1347082 -0.48033 0.6722056 -0.0996775 0.0602863 -0.069608 0.0828925 0.9330115 -0.5558473 0.0558061 -0.8794591 0.8266098 -0.0748314 0.101597 -0.1056073 0.1047603 -0.0033866 0.012315 0.064701 0.1127108 0.0642397 0.0215874 0.0390644 -0.0581038 -0.0516427 0.012144 0.0302006 -0.1123329 0.0284528 0.0760014 0.0072254 -0.1153227 -0.0204835 -0.0515294 -0.0604996 -0.0452911 0.094743 -0.0457434 0.0797947 0.014438 0.0843894 0.0044489 0.0851876 0.1293112 0.0102029 -0.0043817 0.0305267 -0.0735924 -0.0047739 -0.0339978 0.0524598 0.0997531 -0.0699437 -0.0744675 0.0766251 -0.02094 0.0931504 -0.0104938 0.0522641 0.0071683 0.1078047 0.0837736 0.0638209 0.0447746 0.035565 0.0112548 -0.0648897 0.0618505 -0.094639 0.0014283 0.0161645 0.0442226 -0.1299118 0.0189849 0.0747976 0.0115427 -0.1224014 0.0150193 -0.0447583 0.1543404 -0.0000453 -0.0015712 -0.0195936 0.0264015 0.021622 0.0016247 0.0163285 0.1086584 unknown
polarizability: 204.06471|-21.9766882|140.7309087|-9.1128555|-0.0174575|111.8868591 unknown
InChI: InChI=1S/C8H8Br2Cl2N2/c1-8(2,7(9)10)4-3-5(11)13-14-6(4)12/h3,7H,1-2H3
charge 0 multiplicity 1
22 atoms
Br -4.178478 -0.400615 -0.259266
Br -1.64376 -1.058921 -2.271731
Cl -0.500351 2.764969 -0.368818
Cl 3.831829 -1.754773 0.161222
N  1.903631 1.6743 -0.408263
N  2.90114 0.725251 -0.308149
C  -1.309066 -0.349174 0.611947
C  0.150942 0.039016 0.245603
C  -2.221881 -0.043448 -0.617948
C  -1.755029 0.518233 1.837521
C  -1.414714 -1.838818 1.025448
C  1.187993 -0.914246 0.332267
C  0.621865 1.336709 -0.14788
C  2.515124 -0.520684 0.048212
H  -2.195588 1.010502 -0.920512
H  -1.031848 0.379827 2.660724
H  -2.745525 0.18439 2.187644
H  -1.813292 1.592433 1.602154
H  -2.461117 -2.068376 1.283876
H  -1.112246 -2.525759 0.216354
H  -0.801057 -2.036902 1.921703
H  0.982124 -1.948415 0.607189
