program: Gaussian 09
title: 000183690
version: EM64L-G09RevD.01
frameworkgroup: C1[X(C13H17NO4)]
method: RPBEPBE
basis: SDD
operation: Freq
keyword: #p
keyword: freq=noraman
keyword: PBEPBE/SDD
title: #p freq=noraman PBEPBE/SDD
converged: YES YES NO NO
title: Mulliken charges:
elementType: O O O O N C C C C C C C C C C C C C H H H H H H H H H H H H H H H H H
charge: -0.235003 -0.206814 -0.200985 -0.222955 0.121897 -0.187098 -0.237754 -0.426839 -0.414324 -0.128082 0.218015 -0.398606 -0.531645 0.381010 -0.708542 -0.434944 -0.344627 -0.174934 0.250565 0.243385 0.231758 0.209245 0.220036 0.199354 0.311921 0.215170 0.219140 0.245482 0.230106 0.234117 0.248125 0.231983 0.262670 0.316521 0.262651
chargesum: 0.00000
title: Mulliken charges with hydrogens summed into heavy atoms:
elementType: O O O O N C C C C C C C C C C C C C
charge: -0.235003 -0.206814 -0.200985 -0.222955 0.121897 0.063467 0.005632 0.014164 0.005066 0.183840 0.218015 0.035703 -0.056057 0.381010 0.005683 -0.172274 -0.028106 0.087717
polarizability: 1.62942827e+02 -1.31134244e+01 1.44004742e+02 -5.17763394e+00 2.29495353e-01 1.41614213e+02
1716.lowfreq: -14.8037 -7.5931 -0.0003 0.0004 0.0005 5.0409 26.7232 42.8776 46.7146
frequency: 26.5387 42.8249 46.5709 65.3636 70.1573 87.3714 125.4066 133.8765 156.3706 202.6287 216.5098 223.9297 264.5391 283.2419 293.9654 296.3205 325.5682 380.1409 416.8822 454.8069 478.6434 523.6448 592.2952 594.6038 621.9031 651.3651 674.4255 700.0478 705.1324 727.7171 769.8152 796.1066 816.6289 840.5168 846.3805 856.4263 860.3897 883.0441 895.1245 907.3703 953.2553 969.5309 987.4431 1027.5765 1029.5507 1039.8854 1063.0027 1072.7784 1083.5093 1099.3840 1110.9064 1114.5706 1129.8130 1140.2764 1194.7330 1199.8248 1218.4710 1223.8732 1229.7874 1247.6051 1250.8423 1274.9271 1280.0257 1298.3700 1303.8107 1317.9298 1323.5415 1336.6553 1343.2291 1359.3821 1386.3272 1396.7307 1427.1181 1446.8076 1466.3484 1468.0725 1468.9335 1472.4702 1476.1055 1476.7457 1567.7059 1620.7094 2944.3973 2975.0271 2979.1126 2984.4145 2986.4052 2990.3199 2999.6122 3036.8115 3045.6182 3054.9532 3078.0098 3088.6632 3103.9907 3114.9641 3211.6075 3266.6802 3276.6832
redmass: 11.1566 4.1363 5.2006 4.5366 3.5271 6.0636 5.3746 4.8895 3.1810 5.7545 1.1803 3.1647 4.1121 4.7474 3.6644 1.8494 3.9604 3.9390 3.1741 2.9405 3.2958 3.4569 5.1837 4.4170 3.7989 3.2998 4.0293 3.4398 3.2883 1.2746 2.5276 3.9906 1.4487 1.9583 3.4769 2.5341 1.6131 1.7383 1.7773 3.0584 2.2709 2.9104 2.8557 2.1534 1.8408 2.5214 1.5105 1.8713 1.6442 1.8264 2.2356 2.6052 2.1083 2.3448 1.3080 1.7109 2.6875 1.4769 1.5749 1.7009 1.2797 1.4545 1.5106 1.5805 1.3000 1.4334 1.3722 1.4151 1.5183 1.8626 1.2387 2.2603 3.2960 1.0904 1.0999 1.0862 1.1565 3.1186 1.0476 1.1056 5.7723 9.2759 1.0803 1.0625 1.0653 1.0617 1.0615 1.0825 1.0354 1.0980 1.1017 1.1029 1.0977 1.0929 1.0967 1.0981 1.0940 1.1025 1.1041
irintensity: 0.5488 1.7734 0.8815 0.9340 0.2998 2.7940 0.9823 1.9560 5.4675 2.1413 0.3678 2.5730 2.6185 2.0893 1.0296 0.0907 1.5974 5.4593 1.1787 2.9127 7.3750 2.5900 9.9636 11.7797 3.8933 1.9993 8.4697 17.5978 4.2398 33.4104 6.1180 20.8049 53.1892 23.4284 15.7482 3.6024 4.9717 3.3833 2.6039 7.4715 7.1681 8.2493 27.7097 17.6203 11.6349 3.9335 9.5826 13.5185 4.3753 1.2402 11.2088 19.7383 31.1843 8.4625 0.7138 19.2958 32.7354 14.1452 5.9404 21.2215 2.7378 5.6968 51.1077 14.1795 6.8591 2.9662 3.7999 0.2335 0.7324 8.2661 21.8678 10.1586 94.4881 14.9987 8.1447 15.0714 12.7844 10.0253 11.6345 5.4140 1.0479 126.4652 9.7650 32.1184 7.1188 26.6581 33.4177 9.3260 15.1498 35.0327 29.1244 54.2792 20.0874 5.7097 13.9363 5.9183 0.8486 0.4829 7.2734
temp: 298.150 k
press: 1.00000 atm
elementType: 8 8 8 8 7 6 6 6 6 6 6 6 6 6 6 6 6 6 1 1 1 1 1 1 1 1 1 1 1 1 1 1 1 1 1
symmnumber: 1
zpe: 741029.3 jmol-1
zpe.correction: 0.282243 hartree
zpe.thermalcorrener: 0.299510 hartree
zpe.thermalcorrenthalpy: 0.300454 hartree
zpe.thermalcorrgfe: 0.235741 hartree
zpe.sumelectzpe: -859.759386 hartree
zpe.sumelectthermal: -859.742119 hartree
zpe.sumelectthermalent: -859.741175 hartree
zpe.sumelectthermalfe: -859.805888 hartree
dipole: 0.0533 -3.1061 -2.4668
dipole: 3.9668
quadrupole: -95.5503 -118.1979 -110.9499
quadrupole: 8.9708 -1.6679 5.9477
quadrupole: 12.6824 -9.9652 -2.7172 8.9708 -1.6679 5.9477
hfenergy: -860.0416292 hartree
pointgroup: C01 [X(C13H17N1O4)]
dipole: -1.1493685 -0.4858168 0.9373637 debye
polarizability: 154.9669665|-15.8804578|151.1475915|-3.3333391|5.5585024|142.4472244 unknown
InChI: InChI=1S/C13H17NO4/c1-9(14(16)17)13(10-6-7-18-8-10)11-4-2-3-5-12(11)15/h6-9,11,13H,2-5H2,1H3
charge 0 multiplicity 1
35 atoms
O  0.070705 -0.734069 -2.044868
O  -3.097049 1.865233 -0.752052
O  3.38065 0.232675 -0.705119
O  3.010312 0.8811 1.447857
N  2.668355 0.794248 0.207135
C  0.315436 -0.951806 0.402369
C  0.198226 0.594235 0.585147
C  -0.740311 -1.722937 1.260516
C  -0.53561 -3.25166 1.177134
C  1.301517 1.38328 -0.196327
C  0.259196 -1.476597 -1.041565
C  -0.602064 -3.745186 -0.285938
C  0.419897 -2.986594 -1.182426
C  -1.176867 1.166346 0.286087
C  1.322861 2.887402 0.118718
C  -2.039425 1.811087 1.264983
C  -1.856082 1.224079 -0.924035
C  -3.185023 2.216637 0.606821
H  1.308064 -1.264057 0.79711
H  0.400855 0.780847 1.659547
H  -1.756879 -1.458665 0.911636
H  -0.65974 -1.377958 2.309618
H  -1.305282 -3.765205 1.784064
H  0.448535 -3.518839 1.613632
H  1.22134 1.186043 -1.27603
H  -1.623127 -3.58509 -0.685164
H  -0.400561 -4.831079 -0.341597
H  0.3089 -3.256927 -2.24627
H  1.447232 -3.259505 -0.864365
H  2.135349 3.39282 -0.431539
H  0.364424 3.33474 -0.190898
H  1.466054 3.058963 1.199457
H  -1.819659 1.948633 2.322926
H  -1.628119 0.877665 -1.926436
H  -4.09681 2.725537 0.904675
