program: Gaussian 09
title: 000183683
version: EM64L-G09RevD.01
frameworkgroup: C1[X(C11H13FN4)]
method: RPBEPBE
basis: SDD
operation: Freq
keyword: #p
keyword: freq=noraman
keyword: PBEPBE/SDD
title: #p freq=noraman PBEPBE/SDD
converged: YES YES NO NO
title: Mulliken charges:
elementType: F N N N N C C C C C C C C C C C H H H H H H H H H H H H H
charge: -0.198795 -0.099592 -0.351975 -0.420774 -0.151817 -0.486371 -0.529805 0.080027 0.300436 0.233329 0.177705 -0.423174 -0.368864 -0.449987 -0.372978 -0.178926 0.246543 0.271092 0.254703 0.245068 0.303173 0.246014 0.222798 0.211721 0.218259 0.217260 0.314058 0.256645 0.234228
chargesum: 0.00000
title: Mulliken charges with hydrogens summed into heavy atoms:
elementType: F N N N N C C C C C C C C C C C
charge: -0.198795 -0.099592 -0.048802 -0.106716 -0.151817 0.031264 -0.030034 0.080027 0.300436 0.233329 0.177705 -0.177159 0.065655 -0.014468 -0.116334 0.055303
polarizability: 1.98124547e+02 -1.98080603e+00 1.28009979e+02 -9.30624613e+00 2.91373555e+00 1.03649642e+02
1716.lowfreq: -14.5564 -6.5787 -5.8920 -0.0008 -0.0006 -0.0002 20.1126 31.6034 53.9647
frequency: 20.1046 31.5617 53.8090 118.2776 128.4671 137.2370 200.9396 222.7364 233.9012 245.4971 316.3997 413.6450 425.2517 462.6249 478.0629 493.3110 495.7401 532.3507 538.5158 580.3403 620.3943 652.1010 693.9221 700.2112 707.6944 772.2120 782.9852 813.8951 827.7932 842.9272 884.8072 893.0877 944.7289 945.8512 954.4733 962.2169 971.1390 1002.8816 1044.3903 1053.9179 1062.0215 1078.5253 1087.1474 1159.7126 1168.2751 1170.1216 1177.5516 1196.8583 1218.1407 1226.5839 1242.6464 1254.7942 1280.0463 1282.7149 1283.4439 1322.7142 1391.6312 1407.3858 1444.6540 1449.0601 1456.7136 1464.0428 1471.8041 1481.5753 1514.6436 1592.0167 1625.2835 1632.0415 2949.1852 2978.2766 2987.0132 2994.1871 3032.3842 3052.5501 3077.6704 3098.3286 3138.5247 3157.3212 3178.4782 3445.4107 3600.1409
redmass: 4.9043 4.9049 4.4591 2.7363 3.5628 4.2691 4.3331 4.1352 4.5599 4.0620 2.5213 3.3929 4.0440 1.4205 2.3266 3.4360 3.2719 1.6230 3.6550 5.4711 6.9832 7.4915 2.8169 3.9966 3.5087 4.3244 1.4917 4.1137 4.7756 1.5864 1.3958 3.8292 3.1156 3.3864 2.8238 2.6048 1.6501 2.4346 2.4517 2.5005 2.6589 1.7557 1.9299 1.6141 1.1350 1.1687 2.2857 1.1416 1.9759 1.7737 1.5628 1.4132 1.4291 1.4232 1.6542 1.5155 3.3991 1.8432 1.8585 1.3248 2.0030 1.4876 1.3683 1.3509 1.5962 7.1927 5.3533 8.9478 1.0670 1.0675 1.0662 1.0679 1.0933 1.1024 1.0981 1.0966 1.0875 1.0935 1.0976 1.0759 1.0788
irintensity: 1.0417 0.2664 2.5950 3.9860 1.6508 3.3258 9.2829 8.3789 11.4984 1.7841 7.9554 21.4894 15.5599 91.3254 17.7195 31.7955 3.1869 74.3672 12.3347 1.0975 0.3775 13.1467 3.8482 6.5282 4.2722 52.3461 62.4761 18.2901 4.5528 3.4399 1.6885 7.4447 8.8361 15.5979 13.1447 17.1611 7.5954 6.8581 4.0672 1.9959 5.2064 2.3329 13.9868 3.4783 2.4540 0.3050 18.8716 1.2579 34.5131 18.7547 14.7021 28.6766 41.7383 10.4163 6.5158 8.8789 4.6665 5.1745 7.4720 40.1671 29.9230 18.9863 53.0906 72.4421 106.2149 38.8797 458.2998 11.1302 90.3822 91.1605 25.1600 24.8158 57.9634 60.2560 7.7866 3.6990 3.6302 14.6612 7.8889 13.4700 29.8668
temp: 298.150 k
press: 1.00000 atm
elementType: 9 7 7 7 7 6 6 6 6 6 6 6 6 6 6 6 1 1 1 1 1 1 1 1 1 1 1 1 1
symmnumber: 1
zpe: 604305.7 jmol-1
zpe.correction: 0.230168 hartree
zpe.thermalcorrener: 0.244011 hartree
zpe.thermalcorrenthalpy: 0.244956 hartree
zpe.thermalcorrgfe: 0.187619 hartree
zpe.sumelectzpe: -744.595384 hartree
zpe.sumelectthermal: -744.581541 hartree
zpe.sumelectthermalent: -744.580596 hartree
zpe.sumelectthermalfe: -744.637933 hartree
dipole: 1.4971 -2.1255 3.0497
dipole: 4.0074
quadrupole: -86.7694 -91.9435 -96.4387
quadrupole: -7.6474 -11.2893 -0.4630
quadrupole: 4.9478 -0.2263 -4.7215 -7.6474 -11.2893 -0.4630
hfenergy: -744.825552 hartree
pointgroup: C01 [X(C11H13F1N4)]
dipole: -0.5863127 0.0401501 -1.4630252 debye
polarizability: 198.6421349|3.2253124|122.1149888|-5.8336246|10.8315786|109.0270434 unknown
InChI: InChI=1S/C11H13FN4/c12-10-3-1-2-8-6-16(7-9(8)10)15-11-13-4-5-14-11/h1-3,13,15H,4-7H2
charge 0 multiplicity 1
29 atoms
F  -3.162224 1.783629 1.789783
N  0.589809 0.468137 -0.275167
N  1.315383 -0.237259 0.733542
N  3.397007 0.578617 -0.170341
N  3.417713 -1.259606 1.241191
C  -0.461882 1.366631 0.339903
C  -0.160929 -0.465858 -1.210286
C  -1.743296 0.549126 0.261642
C  -1.575223 -0.533611 -0.638845
C  2.700144 -0.346819 0.608636
C  -2.980158 0.705557 0.89567
C  -2.623178 -1.439734 -0.893085
C  4.813332 0.160963 -0.226448
C  4.847517 -0.919205 0.925732
C  -4.050436 -0.181405 0.673255
C  -3.861803 -1.256379 -0.227398
H  -0.544359 2.291161 -0.26357
H  -0.152342 1.644716 1.358851
H  0.362789 -1.434657 -1.26359
H  -0.169341 -0.021756 -2.224968
H  0.854188 -0.973781 1.282995
H  -2.489483 -2.276005 -1.58732
H  5.498575 1.004976 -0.030287
H  5.072132 -0.279312 -1.212526
H  5.397396 -1.827655 0.622999
H  5.340388 -0.512171 1.830643
H  2.925191 1.181451 -0.841677
H  -4.999749 -0.031794 1.19589
H  -4.686261 -1.954855 -0.404623
